{"text_format":"1","workbook":"xlsx","n_sheets":3,"sheets":["Input Wonen","Maatregelen nieuwbouw","Input P1"],"not_rendered":{"charts":0,"images":16,"macros":0,"external_links":5,"defined_names":72,"comments":4,"pivot_tables":0},"unopened":[],"bounds":{"document_bytes":16777216,"sheet_cells":100000,"rows_first":2000,"rows_last":500,"rows_between":2000,"halvings":0,"cell_chars":16384,"cell_head_chars":4096},"cells_cut":0,"cells_raw":0,"read":"whole","date_system":"1900"}

{"sheet":"Input Wonen","index":0,"n_rows":187,"n_cols":32,"rows_kept":187,"cut":false,"hidden":true,"merged":[[183,4,183,7],[183,10,183,13],[183,16,183,19],[185,4,185,7],[185,10,185,13],[185,16,185,19],[176,4,176,7],[176,10,176,13],[176,16,176,19],[181,4,181,7],[181,10,181,13],[181,16,181,19],[151,4,151,7],[151,10,151,13],[147,4,147,7],[147,10,147,13],[115,4,115,7],[115,10,115,13],[124,4,124,7],[124,10,124,13],[130,4,130,7],[130,10,130,13],[136,4,136,7],[136,10,136,13],[27,4,27,7],[27,10,27,13],[49,4,49,7],[49,10,49,13],[78,4,78,7],[78,10,78,13],[45,4,45,7],[45,10,45,13],[10,11,11,11],[10,13,11,13],[12,4,12,7],[12,10,12,13],[3,5,3,7],[10,4,11,4],[10,5,11,5],[10,7,11,7],[10,10,11,10],[10,6,11,6],[10,12,11,12],[10,16,11,16],[10,17,11,17],[10,18,11,18],[10,19,11,19],[12,16,12,19],[130,16,130,19],[136,16,136,19],[147,16,147,19],[151,16,151,19],[27,16,27,19],[49,16,49,19],[78,16,78,19],[115,16,115,19],[124,16,124,19],[45,16,45,19]]}
[]
[]
[null,null,null,null,"Project",null,null,null,null,null,null,null,null,null,null,null,null,null,null,null,"Projectcode:",null,"0447.005"]
[null,null,null,null,"Onderwerp",null,null,null,null,null,"REKENING HOUDEN MET CA 10% EXTRA KOSTEN VOOR WERKZAAMHEDEN DIE NIET INBEGREPEN",null,null,null,null,null,"REKENING HOUDEN MET CA 10% EXTRA KOSTEN VOOR WERKZAAMHEDEN DIE NIET INBEGREPEN"]
[null,null,null,null,"Opgesteld",null,null,null,null,null,"ZIJN IN ONDERSTAANDE WERKZAAMHEDEN. ZOALS: KLEIN TIMMERWERK, SCHILDERWERK, GRONDWERK ",null,null,null,null,null,"ZIJN IN ONDERSTAANDE WERKZAAMHEDEN. ZOALS: KLEIN TIMMERWERK, SCHILDERWERK, GRONDWERK ",null,null,null,"Versie:",null,"0.1"]
[null,null,null,null,"Gecontroleerd",null,null,null,null,null,"EN STEIGER",null,null,null,null,null,"EN STEIGER",null,null,null,"Versie datum:",null,"2022-04-25"]
[null,null,null,null,"Bestand:",null,null,null,null,null,null,null,null,null,null,null,null,null,null,null,"Status:",null,"concept"]
[]
[null,null,null,null,null,null,null,null,null,null,null,null,null,{"$f":"500*0.35*0.47","v":82.25}]
[null,null,null,null,"Traditioneel (RVO Referentieprojecten)",null,null,null,null,null,"Het Nieuwe Normaal 0.4 (HNN0.4)",null,null,null,null,null,"Excellent",null,null,null,null,null,null,"gevel = buitenspouwblad + kozijnen","bg vloer","dak"]
[null,null,null,null,"Element","Materialisatie","Ehd","Ehd.prijs \n(directe bouwkosten)",null,null,"Element","Materialisatie","Ehd","Ehd.prijs \n(directe bouwkosten)",null,null,"Element","Materialisatie","Ehd","Ehd.prijs \n(directe bouwkosten)",null,"Woning","BVO","BGO","BBO","BDO","won"]
[null,null,null,null,null,null,null,null,null,null,null,null,null,null,null,null,null,null,null,null,null,"Woning S tussen",146,{"$f":"#REF!+#REF!","v":{"$error":"#REF!"}},{"$f":"#REF!","v":{"$error":"#REF!"}},{"$f":"#REF!","v":{"$error":"#REF!"}},1,null,null,"Mortel schroefpaal 15 m1","Rond 300",40]
[null,null,null,"ID","Fundering",null,null,null,null,"ID","Fundering",null,null,null,null,"ID","Fundering",null,null,null,null,"Woning 2,5 laag",145,99,54,54,1,null,null,"Mortel schroefpaal 15 m1","Rond 300",40]
[null,null,null,"FU01.t","Funderingsbalken, 350x470mm","In het werk gestort","m1",{"$f":"ROUND((0.35*0.47)*600,-0.1)+1","v":100},null,"FU01.HNN","Funderingsbalken, 350x470mm","Beton met 56% aan secundair aandeel (UMC)","m1",{"$f":"N15","v":109},null,"FU01.E","Funderingsbalken, 350x470mm","Beton met 56% aan secundair aandeel (UMC)","m1",{"$f":"T15","v":109},null,"Woning M hoek",180,{"$f":"#REF!+#REF!","v":{"$error":"#REF!"}},{"$f":"#REF!","v":{"$error":"#REF!"}},{"$f":"#REF!","v":{"$error":"#REF!"}},1,31,null,"Mortel schroefpaal 15 m1","Rond 300",40]
[null,null,null,"FU11.t","Funderingsbalken, 350x470mm","In het werk gestort","m1",{"$f":"ROUND((0.35*0.47)*600,-0.1)+1","v":100},null,"FU11.HNN","Funderingsbalken, 350x470mm","Beton met 56% aan secundair aandeel (UMC)","m1",{"$f":"ROUND((0.35*0.47)*650,-0.1)+2","v":109},null,"FU11.E","Funderingsbalken, 350x470mm","Beton met 56% aan secundair aandeel (UMC)","m1",{"$f":"N15","v":109},null,"Woning M hoek",180,{"$f":"#REF!+#REF!","v":{"$error":"#REF!"}},{"$f":"#REF!","v":{"$error":"#REF!"}},{"$f":"#REF!","v":{"$error":"#REF!"}},1,31,null,"Mortel schroefpaal 15 m1","Rond 300",40]
[null,null,null,"FU02.t","Funderingsbalken, 400x500mm","In het werk gestort","m1",{"$f":"ROUND((0.4*0.5)*600,-0.1)","v":120},null,"FU02.HNN","Funderingsbalken, 400x500mm","Beton met 56% aan secundair aandeel (UMC)","m1",{"$f":"N17","v":129},null,"FU02.E","Funderingsbalken, 400x500mm","Beton met 56% aan secundair aandeel (UMC)","m1",{"$f":"T17","v":129},null,"Woongebouw M",3830,{"$f":"#REF!+#REF!","v":{"$error":"#REF!"}},{"$f":"#REF!","v":{"$error":"#REF!"}},{"$f":"#REF!","v":{"$error":"#REF!"}},31,{"$f":"W16/AA16","v":123.54838709677419},null,"Mortel schroefpaal 20 m1","Rond 350",45]
[null,null,null,"FU09.t","Funderingsbalken, 400x500mm","In het werk gestort","m1",{"$f":"ROUND((0.4*0.5)*600,-0.1)","v":120},null,"FU09.HNN","Funderingsbalken, 400x500mm","Beton met 56% aan secundair aandeel (UMC)","m1",{"$f":"ROUND((0.4*0.5)*650,-0.1)-1","v":129},null,"FU09.E","Funderingsbalken, 400x500mm","Beton met 56% aan secundair aandeel (UMC)","m1",{"$f":"N17","v":129},null,"Woongebouw M",3830,{"$f":"#REF!+#REF!","v":{"$error":"#REF!"}},{"$f":"#REF!","v":{"$error":"#REF!"}},{"$f":"#REF!","v":{"$error":"#REF!"}},31,null,null,"Mortel schroefpaal 20 m1","Rond 350",45]
[null,null,null,"FU06.t","Funderingsbalken, 600x600mm","In het werk gestort","m1",{"$f":"ROUND((0.6*0.6)*600,-0.1)+4","v":220},null,"FU06.HNN","Funderingsbalken, 600x600mm","Beton met 56% aan secundair aandeel (UMC)","m1",{"$f":"N19","v":234},null,"FU06.E","Funderingsbalken, 600x600mm","Beton met 56% aan secundair aandeel (UMC)","m1",{"$f":"T19","v":234}]
[null,null,null,"FU13.t","Funderingsbalken, 600x600mm","In het werk gestort","m1",{"$f":"ROUND((0.6*0.6)*600,-0.1)+4","v":220},null,"FU13.HNN","Funderingsbalken, 600x600mm","Beton met 56% aan secundair aandeel (UMC)","m1",{"$f":"ROUND((0.6*0.6)*650,-0.1)","v":234},null,"FU13.E","Funderingsbalken, 600x600mm","Beton met 56% aan secundair aandeel (UMC)","m1",{"$f":"N19","v":234}]
[null,null,null,"FU03.t","Funderingspaal, ⌀ 300mm; l=15,0m","Schroefpaal; beton, in het werk gestort, C20/25,CEMIII; incl.wapening","m1",50,null,"FU03.HNN","Funderingspaal, ⌀ 300mm; l=15,0m","Beton met 56% aan secundair aandeel (UMC)","m1",{"$f":"N21","v":55},null,"FU03.E","Funderingspaal, ⌀ 300mm; l=15,0m","Beton met 56% aan secundair aandeel (UMC)","m1",{"$f":"T21","v":55},null,"Woonschijf",12400,5382,1550,1550,140,{"$f":"W20/AA20","v":88.571428571428569},null,"Mortel schroefpaal 25 m1","Rond 500",70]
[null,null,null,"FU10.t","Funderingspaal, ⌀ 300mm; l=15,0m","Schroefpaal; beton, in het werk gestort, C20/25,CEMIII; incl.wapening","m1",50,null,"FU10.HNN","Funderingspaal, ⌀ 300mm; l=15,0m","Beton met 56% aan secundair aandeel (UMC)","m1",{"$f":"H21+5","v":55},null,"FU10.E","Funderingspaal, ⌀ 300mm; l=15,0m","Beton met 56% aan secundair aandeel (UMC)","m1",{"$f":"N21","v":55},null,"Woonschijf",12400,5382,1550,1550,140,null,null,"Mortel schroefpaal 25 m1","Rond 500",70]
[null,null,null,"FU04.t","Funderingspaal, ⌀ 350mm, l=20,0m","Schroefpaal; beton, in het werk gestort, C20/25,CEMIII; incl.wapening","m1",60,null,"FU04.HNN","Funderingspaal, ⌀ 350mm, l=20,0m","Beton met 56% aan secundair aandeel (UMC)","m1",{"$f":"N23","v":65},null,"FU04.E","Funderingspaal, ⌀ 350mm, l=20,0m","Beton met 56% aan secundair aandeel (UMC)","m1",{"$f":"T23","v":65},null,"Toren",26544,10118,1106,1106,312,null,null,"Mortel schroefpaal 25 m1","Rond 500",70]
[null,null,null,"FU12.t","Funderingspaal, ⌀ 350mm; l=15,0m","Schroefpaal; beton, in het werk gestort, C20/25,CEMIII; incl.wapening","m1",60,null,"FU12.HNN","Funderingspaal, ⌀ 350mm; l=15,0m","Beton met 56% aan secundair aandeel (UMC)","m1",{"$f":"H23+5","v":65},null,"FU12.E","Funderingspaal, ⌀ 350mm; l=15,0m","Beton met 56% aan secundair aandeel (UMC)","m1",{"$f":"N23","v":65},null,"Toren",26544,10118,1106,1106,312,null,null,"Mortel schroefpaal 25 m1","Rond 500",70]
[null,null,null,"FU08.t","Funderingspaal, ⌀ 500mm; l=25,0m","Schroefpaal; beton, in het werk gestort, C20/25,CEMIII; incl.wapening","m1",80,null,"FU08.HNN","Funderingspaal, ⌀ 500mm; l=25,0m","Beton met 56% aan secundair aandeel (UMC)","m1",{"$f":"N25","v":85},null,"FU08.E","Funderingspaal, ⌀ 500mm; l=25,0m","Beton met 56% aan secundair aandeel (UMC)","m1",{"$f":"T25","v":85},null,"Galerij",10144,7341,1268,1268,136,null,null,"Mortel schroefpaal 25 m1","Rond 500",70]
[null,null,null,"FU14.t","Funderingspaal, ⌀ 500mm; l=25,0m","Schroefpaal; beton, in het werk gestort, C20/25,CEMIII; incl.wapening","m1",80,null,"FU14.HNN","Funderingspaal, ⌀ 500mm; l=25,0m","Beton met 56% aan secundair aandeel (UMC)","m1",{"$f":"H25+5","v":85},null,"FU14.E","Funderingspaal, ⌀ 500mm; l=25,0m","Beton met 56% aan secundair aandeel (UMC)","m1",{"$f":"N25","v":85},null,"Galerij",10144,7341,1268,1268,136,null,null,"Mortel schroefpaal 25 m1","Rond 500",70]
[null,null,null,"FU05.t","Bodemafsluiting, zand","Zand","m2",{"$f":"35*0.1","v":3.5},null,"FU05.HNN","Bodemafsluiting, 100 zand","Zand","m2",{"$f":"H26","v":3.5},null,"FU05.E","Bodemafsluiting, 100 zand","Zand","m2",{"$f":"N26","v":3.5}]
[null,null,null,"FU07.t","Opgaand metselwerk","Kalkzandsteen lijmblokken, 100mm","m2",75,null,"FU07.HNN","Opgaand metselwerk","Kalkzandsteen lijmblokken, 100mm","m2",{"$f":"H27","v":75},null,"FU07.E","Opgaand metselwerk","Kalkzandsteen lijmblokken, 100mm","m2",{"$f":"N27","v":75}]
[null,null,null,null,"Vloeren",null,null,null,null,null,"Vloeren",null,null,null,null,null,"Vloeren"]
[null,null,null,"VL01.t","BG: ribbenvloer, vrijdragend incl. isolatie (Rc=3,7)","Prefab beton","m2",75,null,"VL01.HNN","BG: kanaalplaatvloer, 200mm incl. isolatie (Rc=3,7)","Kanaalplaat, remontabel (28% recyclaat)","m2",96,null,"VL01.E","BG: kanaalplaatvloer, 200mm incl. isolatie (Rc=3,7)","Kanaalplaat, remontabel (28% recyclaat)","m2",{"$f":"N29","v":96}]
[null,null,null,"VL11.t","BG: kanaalplaatvloer, 200mm incl. isolatie (Rc=3,7)","Kanaalplaatvloer; prefab beton","m2",95,null,"VL11.HNN","BG: kanaalplaatvloer, 200mm incl. isolatie (Rc=3,7)","Kanaalplaat, remontabel (28% recyclaat)","m2",{"$f":"H30+15","v":110},null,"VL11.E","BG: kanaalplaatvloer, 200mm incl. isolatie (Rc=3,7)","Kanaalplaat, remontabel (28% recyclaat)","m2",{"$f":"N30","v":110}]
[null,null,null,"VL25.t","BG: kanaalplaatvloer, 260mm incl. isolatie (Rc=3,7)","Kanaalplaatvloer; prefab beton","m2",105,null,"VL25.HNN","BG: kanaalplaatvloer, 260mm incl. isolatie (Rc=3,7)","Kanaalplaat, remontabel (28% recyclaat)","m2",{"$f":"H31+15","v":120},null,"VL25.E","BG: kanaalplaatvloer, 320mm incl. isolatie (Rc=3,7)","Kanaalplaat, remontabel (28% recyclaat)","m2",{"$f":"N31","v":120}]
[null,null,null,"VL02.t","Dekvloeren, 60mm","Zandcement dekvloer","m2",15,null,"VL02.HNN","Dekvloeren, 60mm","Fermacell honingraatvloer (op houten vloer)","m2",45,null,"VL02.E","Dekvloeren, 60mm","Fermacell honingraatvloer (op houten vloer)","m2",45]
[null,null,null,"VL05.t","VV: breedplaatvloer, 270mm incl. druklaag","Breedplaatvloer; incl. druklaag ","m2",135,null,"VL05.HNN","VV: breedplaatvloer, 270mm incl. druklaag","Breedplaatvloer; incl. druklaag (UMC)","m2",{"$f":"H33+10","v":145},null,"VL05.E","VV: CLT incl. dekvloer","CLT verdiepingsvloer ","m2",200]
[null,null,null,"VL26.t","VV: breedplaatvloer, 270mm incl. druklaag","Breedplaatvloer; incl. druklaag","m2",135,null,"VL26.HNN","VV: breedplaatvloer, 270mm incl. druklaag","Breedplaatvloer; incl. druklaag (UMC)","m2",{"$f":"H34+10","v":145},null,"VL26.E","VV: breedplaatvloer, 270mm incl. druklaag","Breedplaatvloer; incl. druklaag (UMC)","m2",{"$f":"N34","v":145}]
[null,null,null,"VL20.t","VV: kanaalplaatvloer, 200mm","Kanaalplaatvloer; prefab beton","m2",85,null,"VL20.HNN","VV: kanaalplaatvloer, 200mm","Kanaalplaatvloer, 200mm (28% recyclaat)","m2",{"$f":"H35+15","v":100},null,"VL20.E","VV: HSB (grondgeb.) ","HSB vloerelement (stijlen+OSB), 18mm; IsoVlas 60mm; gipsplaat (2x)","m2",160]
[null,null,null,"VL07.t","Dekvloeren, 60mm","Zandcement dekvloer","m2",15,null,"VL07.HNN","Dekvloeren, 60mm","Fermacell honingraatvloer (op houten vloer)","m2",45,null,"VL07.E","Dekvloeren, 60mm","Fermacell honingraatvloer (op houten vloer)","m2",{"$f":"N36","v":45}]
[null,null,null,"VL23.t","Geïsoleerd vloerluik","Houtvezelcement, EPS, stalen ravel","m2",100,null,"VL23.HNN","Geïsoleerd vloerluik","Houtvezelcement, EPS, stalen ravel","m2",{"$f":"H37","v":100},null,"VL23.E","Geïsoleerd vloerluik","Houtvezelcement, EPS, stalen ravel","m2",{"$f":"N37","v":100}]
[null,null,null,"VL03.t","Vloertegelwerk toilet","Keramische tegels, geglazuurd/gelijmd","m2",100,null,"VL03.HNN","Vloertegelwerk toilet","Mosa C2C vloertegels","m2",100,null,"VL03.E","Vloertegelwerk toilet","Mosa C2C vloertegels (losmaakbaar)","m2",200]
[null,null,null,"VL04.t","Vloertegelwerk badkamer","Keramische tegels, geglazuurd/gelijmd","m2",100,null,"VL04.HNN","Vloertegelwerk badkamer","Mosa C2C vloertegels","m2",100,null,"VL04.E","Vloertegelwerk badkamer","Mosa C2C vloertegels (losmaakbaar)","m2",200]
[null,null,null,"VL08.t","Plafondafwerking","Spuitpleister","m2",8,null,"VL08.HNN","Plafondafwerking","Spuitpleister","m2",{"$f":"H40","v":8},null,"VL08.E","Plafondafwerking","Spuitpleister","m2",8]
[null,null,null,"VL22.t","Plafondafwerking, verlaagd plafond","Glaswoltegels","m2",40,null,"VL22.HNN","Plafondafwerking","Glaswoltegels","m2",{"$f":"H41","v":40},null,"VL22.E","Plafondafwerking","Glaswoltegels","m2",{"$f":"N41","v":40}]
[null,null,null,"VL09.t","Balkon- en galerijvloeren","Prefab beton, 250mm","m2",450,null,"VL09.HNN","Balkon- en galerijvloeren","Prefab beton, 250mm","m2",{"$f":"H42","v":450},null,"VL09.E","Balkon- en galerijvloeren","HSB element houten vloer + stalen ophanging (56,8 kg/m2 zie detail berekening excel)","m2",850]
[null,null,null,"VL10.t","Balustrades","Aluminium; geanodiseerd","m1",300,null,"VL10.HNN","Balustrades","Houten balustrades","m1",300,null,"VL10.E","Balustrades","Houten balustrades","m1",300]
[null,null,null,"VL21.t","Balustrades","RVS, incl. glasplaat vulling","m1",350,null,"VL21.HNN","Balustrades","RVS, incl. glasplaat vulling","m1",{"$f":"H44","v":350},null,"VL21.E","Balustrades","RVS, incl. glasplaat vulling","m1",{"$f":"N44","v":350}]
[null,null,null,"VL24.t","Balustrades","Staal; gepoedercoat; spijlen","m1",250,null,"VL24.HNN","Balustrades","Staal; gepoedercoat; spijlen","m1",{"$f":"H45","v":250},null,"VL24.E","Balustrades","Staal; gepoedercoat; spijlen","m1",{"$f":"N45","v":250}]
[null,null,null,null,"Draagconstructie",null,null,null,null,null,"Draagconstructie",null,null,null,null,null,"Draagconstructie"]
[null,null,null,"DR01.t","Betonmortel","C20/C25,XC1,S3; 0% betongranulaat","m3",500,null,"DR01.HNN","Betonmortel","C20/C25,XC1,S3; 20% betongranulaat","m3",510,null,"DR01.E","Betonmortel","C20/C25,XC1,S3; 56% betongranulaat","m3",515]
[null,null,null,"DR02.t","Wapeningsstaal","Staal","kg",2,null,"DR02.HNN","Wapeningsstaal","Staal","kg",{"$f":"H48","v":2},null,"DR02.E","Wapeningsstaal","Staal","kg",{"$f":"N48","v":2}]
[null,null,null,"DR03.t","Zwaar constructiestaal","7.820 kg/m3, incl. conservering","kg",4,null,"DR03.HNN","Zwaar constructiestaal","7.820 kg/m3, incl. conservering","kg",{"$f":"H49","v":4},null,"DR03.E","Zwaar constructiestaal","7.820 kg/m3, incl. conservering","kg",{"$f":"N49","v":4}]
[null,null,null,null,"Gevel",null,null,null,null,null,"Gevel",null,null,null,null,null,"Gevel"]
[null,null,null,"GE09.t","Buitenspouwblad, 100mm","Baksteenmetselwerk","m2",150,null,"GE09.HNN","Buitenspouwblad","Ecobrick Wienerberger","m2",150,null,"GE09.E","Buitenspouwblad","Houten gevelbekleding; Meranti delen","m2",200]
[null,null,null,"GE10.t","Isolatielagen, Rc=4,7","PUR/PIR schuimplaten","m2",30,null,"GE10.HNN","Isolatielagen, Rc=4,7","Isovlas plaat, PN160mm","m2",45,null,"GE10.E","Isolatielagen, Rc=4,7","Isovlas plaat, PN160mm","m2","HSB is incl. isolatie"]
[null,null,null,"GE26.t","Isolatielagen, Rc=4,7","Glaswolplaten, MWA 2012","m2",20,null,"GE26.HNN","Isolatielagen, Rc=4,7","Isovlas plaat, PN160mm","m2",45,null,"GE26.E","Isolatielagen, Rc=4,7","Isovlas plaat, PN160mm","m2",{"$f":"N53","v":45}]
[null,null,null,"GE37.t","Isolatielagen, Rc=0,55","XPS","m2",30,null,"GE37.HNN","Binnenwanden, 35mm","Faay volpaneel","m2",70,null,"GE37.E","Binnenwanden, 35mm","Faay volpaneel","m2",{"$f":"N54","v":70}]
[null,null,null,"GE70.t","Isolatielagen, Rc=4,7","Isover Mupan Ultra XS","m2",30,null,"GE70.HNN","Isolatielagen, Rc=4,7","Isover Mupan Ultra XS","m2",{"$f":"H55","v":30},null,"GE70.E","Isolatielagen, Rc=4,7","Isover Mupan Ultra XS","m2",{"$f":"N55","v":30}]
[null,null,null,"GE11.t","Binnenspouwblad, 100mm (bruto)","Prefab beton","m2",120,null,"GE11.HNN","Binnenspouwblad, 100mm (bruto)","Prefab beton (UMC)","m2",{"$f":"H56+0.1*25","v":122.5},null,"GE11.E","Binnenspouwblad, HSB (bruto)","HSB element incl. Isovlas isolatie","m2",220]
[null,null,null,"GE40.t","Binnenspouwblad, 150mm (bruto)","Prefab beton","m2",145,null,"GE40.HNN","Binnenspouwblad, 150mm (bruto)","Prefab beton","m2",{"$f":"H57","v":145},null,"GE40.E","Binnenspouwblad, HSB (bruto)","HSB element incl. Isovlas isolatie","m2",240]
[null,null,null,"GE60.t","Binnenspouwblad, 200mm (bruto)","Prefab beton","m2",170,null,"GE60.HNN","Binnenspouwblad, 200mm (bruto)","Prefab beton","m2",{"$f":"H58","v":170},null,"GE60.E","Binnenspouwblad, HSB (bruto)","HSB element incl. Isovlas isolatie","m2",240]
[null,null,null,"GE24.t","Binnenspouwblad, 250mm (bruto)","I.h.w.g. beton","m2",240,null,"GE24.HNN","Binnenspouwblad, 250mm (bruto)","I.h.w.g. beton (UMC)","m2",{"$f":"H59+0.25*25","v":246.25},null,"GE24.E","Binnenspouwblad, CLT","CLT wanden","m2",260]
[null,null,null,"GE25.t","Binnenspouwblad; niet dragend, 250mm (bruto)","HSB element incl. isolatie en beplating","m2",240,null,"GE25.HNN","Binnenspouwblad; niet dragend, 250mm (bruto)","HSB element incl. isolatie en beplating","m2",{"$f":"H60","v":240},null,"GE25.E","Binnenspouwblad; niet dragend HSB (bruto)","HSB element incl. Isovlas isolatie","m2",250]
[null,null,null,"GE42.t","Binnenspouwblad, 100mm","Cellenbeton blokken, XellaYtong","m2",60,null,"GE42.HNN","Binnenspouwblad, 100mm","Cellenbeton blokken, XellaYtong","m2",{"$f":"H61","v":60},null,"GE42.E","Binnenspouwblad, HSB (bruto)","HSB element incl. Isovlas isolatie","m2",230]
[null,null,null,"GE50.t","Gevelkozijnen; incl. HR++ beglazing","Az. loofhout (Meranti), geschilderd","m2",550,null,"GE50.HNN","Gevelkozijnen; incl. HR++ beglazing","Europees naaldhout, geschilderd","m2",550,null,"GE50.E","Gevelkozijnen; incl. Isomax beglazing","Europees naaldhout, geschilderd","m2",{"$f":"N62+10","v":560}]
[null,null,null,"GE51.t","Gevelkozijnen; incl. HR++ beglazing","Europees naaldhout, geschilderd","m2",550,null,"GE51.HNN","Gevelkozijnen; incl. HR++ beglazing","Europees naaldhout, geschilderd","m2",550,null,"GE51.E","Gevelkozijnen; incl. Isomax beglazing","Europees naaldhout, geschilderd","m2",{"$f":"N63+10","v":560}]
[null,null,null,"GE29.t","Gevelkozijnen; incl. HR++ beglazing","Aluminium","m2",600,null,"GE29.HNN","Gevelkozijnen; incl. HR++ beglazing","Aluminium; 75% recyclaat (Hydro CIRCAL 75R)","m2",600,null,"GE29.E","Gevelkozijnen; incl. Isomax beglazing","Aluminium; 75% recyclaat (Hydro CIRCAL 75R)","m2",610]
[null,null,null,"GE35.t","Gevelkozijn; schuifpui ","Aluminium, vast en/of draaiend","m2",600,null,"GE35.HNN","Gevelkozijn, schuifpui ","Aluminium, vast en/of draaiend","m2",{"$f":"H65","v":600},null,"GE35.E","Gevelkozijn, schuifpui ","Aluminium, vast en/of draaiend","m2",{"$f":"N65","v":600}]
[null,null,null,"GE03.t","Stelkozijnen","Onverduurzaamd hout, geverfd","st",80,null,"GE03.HNN","Stelkozijnen","Onverduurzaamd hout, geverfd","st",{"$f":"H66","v":80},null,"GE03.E","Stelkozijnen","Onverduurzaamd hout, geverfd","st",{"$f":"N66","v":80}]
[null,null,null,"GE02.t","Beglazing","Triple glas; droog beglaasd","m2",135,null,"GE02.HNN","Beglazing","Triple glas; droog beglaasd","m2",{"$f":"H67","v":135},null,"GE02.E","Beglazing","HR++; droog beglaasd, IsoMax","m2",70]
[null,null,null,"GE38.t","Beglazing","HR++ (dubbel)","m2",65,null,"GE38.HNN","Beglazing","HR++ (dubbel)","m2",{"$f":"H68","v":65},null,"GE38.E","Beglazing","HR++; droog beglaasd, IsoMax","m2",70]
[null,null,null,"GE08.t","Buitendeur; incl. glasopening 0,85m2","Onverduurzaamd hout, geverfd","st",950,null,"GE08.HNN","Buitendeur; incl. glasopening 0,85m2","Onverduurzaamd hout, geverfd","st",950,null,"GE08.E","Buitendeur; incl. glasopening 0,85m2","Onverduurzaamd hout, geverfd","st",950]
[null,null,null,"GE34.t","Buitendeur; multiplex","Sandwich; 2x multiplex","st",950,null,"GE34.HNN","Buitendeur; multiplex","Sandwich; 2x multiplex","st",{"$f":"H70","v":950},null,"GE34.E","Buitendeur; multiplex","Sandwich; 2x multiplex","st",950]
[null,null,null,"GE36.t","Buitendeur; aluminium","Aluminium, gemoffeld; bekleding volkern","st",1500,null,"GE36.HNN","Buitendeur; aluminium","Aluminium, gemoffeld; bekleding volkern","st",{"$f":"H71","v":1500},null,"GE36.E","Buitendeur; aluminium","Aluminium, gemoffeld; bekleding volkern","st",{"$f":"N71","v":1500}]
[null,null,null,"GE22.t","Lateien","Prefab beton","m1",70,null,"GE22.HNN","Lateien","Prefab beton","m2",{"$f":"H72","v":70},null,"GE22.E","Lateien","Prefab beton","m2",70]
[null,null,null,"GE31.t","Vensterbanken","Kunststeen","m1",50,null,"GE31.HNN","Vensterbanken","Kunststeen","m1",{"$f":"H73","v":50},null,"GE31.E","Vensterbanken","Kunststeen","m1",50]
[null,null,null,"GE04.t","Vensterbanken","Composietsteen ","m1",45,null,"GE04.HNN","Vensterbanken","Composietsteen","m1",45,null,"GE04.E","Vensterbanken","Composietsteen","m1",45]
[null,null,null,"GE05.t","Waterslagen","Prefab beton","m1",70,null,"GE05.HNN","Waterslagen","Prefab beton","m1",70,null,"GE05.E","Waterslagen","Prefab beton","m1",{"$f":"N75","v":70}]
[null,null,null,"GE32.t","Waterslagen","Aluminium; gemoffeld","m1",45,null,"GE32.HNN","Waterslagen","Aluminium; gemoffeld","m1",45,null,"GE32.E","Waterslagen","Aluminium; gemoffeld","m1",{"$f":"N76","v":45}]
[null,null,null,"GE33.t","Waterslagen","Composietsteen; gegoten","m1",40,null,"GE33.HNN","Waterslagen","Composietsteen; gegoten","m1",40,null,"GE33.E","Waterslagen","Composietsteen; gegoten","m1",{"$f":"N77","v":40}]
[null,null,null,"GE06.t","Waterkeringen","EPDM-folie","m1",15,null,"GE06.HNN","Waterkeringen","EPDM-folie","m1",15,null,"GE06.E","Waterkeringen","EPDM-folie","m1",{"$f":"N78","v":15}]
[null,null,null,null,"Daken",null,null,null,null,null,"Daken",null,null,null,null,null,"Daken"]
[null,null,null,"DA01.t","Dakconstructie, hellend; Rc=6,3","Prefab houten dakelement","m2",100,null,"DA01.HNN","Dakconstructie, hellend; Rc=6,3","HSB hellenddakelement incl. vlasisolatie","m2",125,null,"DA01.E","Dakconstructie, hellend; Rc=6,3","HSB hellenddakelement incl. vlasisolatie","m2",{"$f":"N80","v":125}]
[null,null,null,"DA02.t","Dakvloer: breedplaatvloer, 270mm incl. druklaag","Breedplaatvloer; incl. druklaag ","m2",130,null,"DA02.HNN","Dakvloer: breedplaatvloer, 270mm incl. druklaag","Breedplaatvloer; incl. druklaag (UMC)","m2",{"$f":"H81+0.21*25","v":135.25},null,"DA02.E","Dakconstructie, plat dak","CLT excl. isolatie","m2",180]
[null,null,null,"DA17.t","Dakconstructie, plat dak; kanaalplaat","Kanaalplaatvloer, 200mm; prefab beton","m2",85,null,"DA17.HNN","Dakconstructie, plat dak; kanaalplaat","Kanaalplaatvloer, 200mm; prefab beton","m2",{"$f":"H82","v":85},null,"DA17.E","Dakconstructie, plat dak","HSB vloerelement (stijlen+OSB); IsoVlas 60mm; incl. gipskartonplafond","m2",160]
[null,null,null,"DA18.t","Dakconstructie, plat dak breedplaat incl. druklaag","Breedplaatvloer, 290mm;","m2",95,null,"DA18.HNN","Dakconstructie, plat dak breedplaat incl. druklaag","Breedplaatvloer, 290mm;","m2",{"$f":"H83","v":95},null,"DA18.E","Dakconstructie, plat dak","CLT excl. isolatie","m2",200]
[null,null,null,"DA05.t","Isolatielagen; plat dak; Rc=6,3","XPS","m2",{"$f":"60%*120","v":72},null,"DA05.HNN","Isolatielagen; plat dak; Rc=6,3","Drukvaste houtvezelisolatie","m2",{"$f":"H84+10","v":82},null,"DA05.E","Isolatielagen; plat dak; Rc=6,3","Drukvaste houtvezelisolatie","m2",{"$f":"N84","v":82}]
[null,null,null,"DA16.t","Isolatielagen; plat dak; Rc=6,3","EPS","m2",{"$f":"60%*120","v":72},null,"DA16.HNN","Isolatielagen; plat dak; Rc=6,3","Houtvezel vlakke isolatieplaten","m2",{"$f":"H85+10","v":82},null,"DA16.E","Isolatielagen; plat dak; Rc=6,3","Houtvezel vlakke isolatieplaten","m2",{"$f":"N85","v":82}]
[null,null,null,"DA04.t","Dakafwerking","Daktrim; aluminium gemoffeld","m1",15,null,"DA04.HNN","Dakafwerking","Daktrim; aluminium gemoffeld","m2",{"$f":"H86","v":15},null,"DA04.E","Dakafwerking","Daktrim; aluminium gemoffeld","m2",{"$f":"N86","v":15}]
[null,null,null,"DA06.t","Dakafwerking","Betonpan","m2",35,null,"DA06.HNN","Dakafwerking","Hergebruikte keramische pan","m2",40,null,"DA06.E","Dakafwerking","Hergebruikte keramische pan","m2",40]
[null,null,null,"DA07.t","Dakafwerking","Grind","m2",22,null,"DA07.HNN","Dakafwerking","Grind","m2",{"$f":"H88","v":22},null,"DA07.E","Dakafwerking","Grind","m2",22]
[null,null,null,"DA15.t","Dakafwerking","Rubbertegel; ballastlaag","m2",40,null,"DA15.HNN","Dakafwerking","Rubbertegel; ballastlaag","m2",{"$f":"H89","v":40},null,"DA15.E","Dakafwerking","Rubbertegel; ballastlaag","m2",40]
[null,null,null,"DA09.t","Dakbedekking","Bitumen, gemod. eenlaags 4,3mm","m2",{"$f":"40%*120","v":48},null,"DA09.HNN","Dakbedekking","EPDM losmaakbare dakbedekking","m2",70,null,"DA09.E","Dakbedekking","EPDM losmaakbare dakbedekking","m2",70]
[null,null,null,"DA43.t","Dakrand binnenblad, 100mm","Cellenbeton blokken, XellaYtong","m2",60,null,"DA43.HNN","Dakrand binnenblad, 100mm","Cellenbeton blokken, XellaYtong","m2",{"$f":"H91","v":60},null,"DA43.E","Dakrand binnenblad, 100mm","HSB element incl. Isovlas isolatie","m2",230]
[null,null,null,"DA10.t","Dakraam","Meranti, geschilderd","st",1000,null,"DA10.HNN","Dakraam","Velux Reclaimed dakraam","st",1050,null,"DA10.E","Dakraam","Velux Reclaimed dakraam","st",1050]
[null,null,null,"DA11.t","Waterkeringen","EPDM aluminium versterkt","m1",45,null,"DA11.HNN","Waterkeringen","EPDM aluminium versterkt","m1",{"$f":"H93","v":45},null,"DA11.E","Waterkeringen","EPDM aluminium versterkt","m1",45]
[null,null,null,"DA14.t","Waterkeringen","Polyetheen; folie","m1",1,null,"DA14.HNN","Waterkeringen","Polyetheen; folie","m1",{"$f":"H94","v":1},null,"DA14.E","Waterkeringen","Polyetheen; folie","m1",1]
[null,null,null,"DA12.t","Plafondafwerking","Spuitpleister","m2",8,null,"DA12.HNN","Plafondafwerking (grondgeb.)","Spuitpleiser","m2",{"$f":"H95","v":8},null,"DA12.E","Plafondafwerking (grondgeb.)","Spuitpleiser","m2",8]
[null,null,null,"DA13.t","Bekledingen en roosters verlaagde plafonds","Spaanplaat (incl. regelwerk)","m2",50,null,"DA13.HNN","Bekleding en roosters, refurbished plafondplaten (Insert)","Hergebruikte / refurbished plafondplaten","m2",50,null,"DA13.E","Bekleding en roosters, refurbished plafondplaten (Insert)","Hergebruikte / refurbished plafondplaten","m2",50]
[null,null,null,null,"Binnenwanden",null,null,null,null,null,"Binnenwanden",null,null,null,null,null,"Binnenwanden"]
[null,null,null,"BI02.t","Woningscheidende wanden, 100mm;","Prefab beton","m2",120,null,"BI02.HNN","Woningscheidende wanden, 100mm;","Prefab beton","m2",{"$f":"H98","v":120},null,"BI02.E","Woningscheidende wanden, HSB","HSB binnenwand element met vlasisolatie","m2",220]
[null,null,null,"GE28.t","Binnenwanden, 150mm","Prefab beton","m2",170,null,"GE28.HNN","Binnenwanden, 150mm","Prefab beton","m2",{"$f":"H99","v":170},null,"GE28.E","Binnenwanden HSB","HSB binnenwand element met vlasisolatie","m2",235]
[null,null,null,"BI40.t","Binnenwanden, 250mm","Prefab beton","m2",240,null,"BI40.HNN","Binnenwanden, 250mm","Prefab beton","m2",{"$f":"H100","v":240},null,"BI40.E","Binnenwanden, 250mm","Prefab beton (UMC)","m2",{"$f":"N100+0.25*25","v":246.25}]
[null,null,null,"BI01.t","Dragende binnenwanden, 250mm; ","I.h.w.g. beton","m2",240,null,"BI01.HNN","Dragende binnenwanden, 250mm; ","I.h.w.g. beton (UMC)","m2",{"$f":"H101+0.25*25","v":246.25},null,"BI01.E","Dragende binnenwanden","I.h.w.g. beton (UMC)","m2",{"$f":"N101","v":246.25}]
[null,null,null,"GE27.t","Dragende binnenwanden, 250mm; ","I.h.w.g. beton","m2",240,null,"GE27.HNN","Dragende binnenwanden, 250mm; ","I.h.w.g. beton (UMC)","m2",{"$f":"H102+0.25*25","v":246.25},null,"GE27.E","Dragende binnenwanden","CLT wanden","m2",260]
[null,null,null,"BI03.t","Binnenwanden, 100mm","Kalkzandsteen lijmblokken, 100mm","m2",65,null,"BI03.HNN","Binnenwanden, 100mm","Faay volpaneel","m2",{"$f":"H103+25","v":90},null,"BI03.E","Binnenwanden, 100mm","Faay volpaneel","m2",115]
[null,null,null,"BI05.t","Binnenwanden, 70mm","Gipsblokken, normale dichtheid","m2",50,null,"BI05.HNN","Binnenwanden, 70mm","Faay volpaneel","m2",80,null,"BI05.E","Binnenwanden, 70mm","Faay volpaneel","m2",{"$f":"N104","v":80}]
[null,null,null,"BI06.t","Binnenwanden, 70mm","Gipsblokken, hoge dichtheid","m2",55,null,"BI06.HNN","Binnenwanden, 70mm","Faay volpaneel","m2",80,null,"BI06.E","Binnenwanden, 70mm","Faay volpaneel","m2",{"$f":"N105","v":80}]
[null,null,null,"BI14.t","Systeemwanden; gipskartonplaat, 100mm","Enkel beplaat, 60 mm glaswol","m2",50,null,"BI14.HNN","Binnenwanden, 35mm","Faay volpaneel","m2",70,null,"BI14.E","Binnenwanden, 54mm","Faay volpaneel; enkel beplaat","m2",75]
[null,null,null,"BI16.t","Systeemwanden; gipskartonplaat, 100mm","Dubbel beplaat, 40 mm glaswol","m2",60,null,"BI16.HNN","Systeemwanden; niet constructief, 100mm","HSB binnenwand element met vlasisolatie","m2",110,null,"BI16.E","Binnenwanden, 100mm","Faay volpaneel; dubbel beplaat","m2",90]
[null,null,null,"BI04.t","Wandtegelwerk badkamer, toilet en keuken","Keramische tegels; geglazuurd/gelijmd","m2",75,null,"BI04.HNN","Wandtegelwerk badkamer, toilet en keuken","Mosa C2C wandtegels","m2",{"$f":"H108","v":75},null,"BI04.E","Wandtegelwerk badkamer, toilet en keuken","Gerecycled PET i.c.m. Quartz","m2",150]
[null,null,null,"BI08.t","Binnendeuren","Honingraat; vlakke binnendeur","st",100,null,"BI08.HNN","Binnendeuren","Honingraat; vlakke binnendeur","st",{"$f":"H109","v":100},null,"BI08.E","Binnendeuren","Honingraat; vlakke binnendeur","st",100]
[null,null,null,"BI09.t","Binnendeuren","Spaanplaat; geschilderd","st",320,null,"BI09.HNN","Binnendeuren","Spaanplaat; geschilderd","st",{"$f":"H110","v":320},null,"BI09.E","Binnendeuren","Spaanplaat; geschilderd","st",{"$f":"N110","v":320}]
[null,null,null,"BI11.t","Binnenkozijnen","Staal; verzinkt+gemoffeld","m2",50,null,"BI11.HNN","Binnenkozijnen","Europees naaldhout, geschilderd","m2",{"$f":"75+25+(0.3*50)","v":115},null,"BI11.E","Binnenkozijnen","Europees naaldhout, geschilderd","m2",{"$f":"N111","v":115}]
[null,null,null,"BI12.t","Binnenkozijnen, incl. deuren","Europees naaldhout, geschilderd","m2",400,null,"BI12.HNN","Binnenkozijnen, incl. deuren","Europees naaldhout, geschilderd","m2",{"$f":"H112","v":400},null,"BI12.E","Binnenkozijnen, incl. deuren","Europees naaldhout, geschilderd","m2",400]
[null,null,null,"BI15.t","Binnenkozijnen","Staal; verzinkt+gemoffeld","m2",50,null,"BI15.HNN","Binnenkozijnen","Staal; verzinkt+gemoffeld","m2",{"$f":"H113","v":50},null,"BI15.E","Binnenkozijnen","Staal; verzinkt+gemoffeld","m2",{"$f":"N113","v":50}]
[null,null,null,"BI17.t","Binnenbeglazing","Enkel glas","m2",35,null,"BI17.HNN","Binnenbeglazing","Enkel glas","m2",{"$f":"H114","v":35},null,"BI17.E","Binnenbeglazing","Enkel glas","m2",{"$f":"N114","v":35}]
[null,null,null,"BI10.t","Binnendorpels","Gegoten composietsteen","m1",35,null,"BI10.HNN","Binnendorpels","Kunststeen","m1",{"$f":"H115","v":35},null,"BI10.E","Binnendorpels","Kunststeen","m1",{"$f":"N115","v":35}]
[null,null,null,null,"Klimaatinstallaties",null,null,null,null,null,"Klimaatinstallaties",null,null,null,null,null,"Klimaatinstallaties"]
[null,null,null,"KL01.t","Warmteopwekkinginstallatie","Warmtepomp luchtwater 10kW ","won","PM",null,"KL01.HNN","Warmteopwekkinginstallatie","Warmtepomp luchtwater 10kW ","won","PM",null,"KL01.E","Warmteopwekkinginstallatie","Warmtepomp luchtwater 10kW ","won","PM"]
[null,null,null,"KL08.t","Warmteopwekkinginstallatie","Warmtepomp luchtwater 10kW","won","PM",null,"KL08.HNN","Warmteopwekkinginstallatie","Warmtepomp luchtwater 10kW","won","PM",null,"KL08.E","Warmteopwekkinginstallatie","Warmtepomp luchtwater 10kW","won","PM"]
[null,null,null,"KL02.t","Warmtedistributiesysteem","CV-leidingen incl. koppelingen + verdeling","m2gbo","PM",null,"KL02.HNN","Warmtedistributiesysteem","CV-leidingen incl. koppelingen + verdeling","m2gbo","PM",null,"KL02.E","Warmtedistributiesysteem","CV-leidingen incl. koppelingen + verdeling","m2gbo","PM"]
[null,null,null,"KL03.t","Warmteafgiftesysteem","Vloerverwarming 95 W/m2","m2gbo","PM",null,"KL03.HNN","Warmteafgiftesysteem","Vloerverwarming 95 W/m2","m2gbo","PM",null,"KL03.E","Warmteafgiftesysteem","Vloerverwarming 95 W/m2 ","m2gbo","PM"]
[null,null,null,"KL04.t","Luchtdistributiesysteem","VLA ventilatiesysteem, type C; W-bouw, individueel","m2gbo","PM",null,"KL04.HNN","Luchtdistributiesysteem","VLA ventilatiesysteem, type C; W-bouw, individueel","m2gbo","PM",null,"KL04.E","Luchtdistributiesysteem","VLA ventilatiesysteem, type C; W-bouw, individueel","m2gbo","PM"]
[null,null,null,"KL05.t","Luchtdistributiesysteem","VLA ventilatiesysteem, type D met centrale wtw; W-bouw, individueel","m2gbo","PM",null,"KL05.HNN","Luchtdistributiesysteem","VLA ventilatiesysteem, type D met centrale wtw; W-bouw, individueel","m2gbo","PM",null,"KL05.E","Luchtdistributiesysteem","VLA ventilatiesysteem, type D met centrale wtw; W-bouw, individueel","m2gbo","PM"]
[null,null,null,"KL06.t","Waterleidingen, verwarmd tapwater","PVC, incl. mantelbuis 15mm; W-bouw","m2gbo","PM",null,"KL06.HNN","Waterleidingen, verwarmd tapwater","PVC, incl. mantelbuis 15mm; W-bouw","m2gbo","PM",null,"KL06.E","Waterleidingen, verwarmd tapwater","PVC, incl. mantelbuis 15mm; W-bouw","m2gbo","PM"]
[null,null,null,"KL07.t","Warmtapwaterinstallatie","Elektrische boiler; CW:4-6 120 liter","st","PM",null,"KL07.HNN","Warmtapwaterinstallatie","Elektrische boiler; CW:4-6 120 liter","st","PM",null,"KL07.E","Warmtapwaterinstallatie","Elektrische boiler; CW:4-6 120 liter","st","PM"]
[null,null,null,null,"Elektrische installaties",null,null,null,null,null,"Elektrische installaties",null,null,null,null,null,"Elektrische installaties"]
[null,null,null,"EL01.t","Elektriciteitsleidingen","Geïsoleerde installatiedraad + mantelbuis","m2gbo","PM",null,"EL01.HNN","Elektriciteitsleidingen","Geïsoleerde installatiedraad + mantelbuis","m2gbo",{"$f":"H126","v":"PM"},null,"EL01.E","Elektriciteitsleidingen","Geïsoleerde installatiedraad + mantelbuis","m2gbo",{"$f":"N126","v":"PM"}]
[null,null,null,"EL02.t","Pv-panelen, hellend dak","Mono-Si; incl. inverter+kabels","m2",230,null,"EL02.HNN","Pv-panelen, hellend dak","Exasun Xglass","m2",260,null,"EL02.E","Pv-panelen, hellend dak","Exasun Xroof (deels tvv van dakpannen)","m2",320]
[null,null,null,"EL03.t","Pv-panelen, plat dak","Mono-Si; incl. inverter+kabels","m2",230,null,"EL03.HNN","Pv-panelen, plat dak","Exasun Xglass","m2",260,null,"EL03.E","Pv-panelen, plat dak","Exasun Xglass","m2",260]
[null,null,null,"EL04.t","Verlichting","LED-120cm","m2gbo","PM",null,"EL04.HNN","Verlichting","LED-120cm","m2gbo",{"$f":"H129","v":"PM"},null,"EL04.E","Verlichting","LED-120cm","m2gbo",{"$f":"N129","v":"PM"}]
[null,null,null,"EL05.t","Elektriciteitsleidingen","Koper met PP-isolatie","m2gbo","PM",null,"EL05.HNN","Elektriciteitsleidingen","Koper met PP-isolatie","m2gbo",{"$f":"H130","v":"PM"},null,"EL05.E","Elektriciteitsleidingen","Koper met PP-isolatie","m2gbo",{"$f":"N130","v":"PM"}]
[null,null,null,null,"Toe- en afvoeren",null,null,null,null,null,"Toe- en afvoeren",null,null,null,null,null,"Toe- en afvoeren"]
[null,null,null,"TO01.t","Waterleidingen","Polyetheen; leiding+mantelbuis","m2gbo","PM",null,"TO01.HNN","Waterleidingen","Polyetheen","m2gbo",{"$f":"H132","v":"PM"},null,"TO01.E","Waterleidingen","Polyetheen","m2gbo",{"$f":"N132","v":"PM"}]
[null,null,null,"TO02.t","Buitenriolering kavel","PVC","m2gbo","PM",null,"TO02.HNN","Buitenriolering","Gerecycled PVC (Pipelife)","m2gbo",{"$f":"H133","v":"PM"},null,"TO02.E","Buitenriolering","Gerecycled PVC (Pipelife)","m2gbo",{"$f":"N133","v":"PM"}]
[null,null,null,"TO03.t","Binnenriolering","PVC","m2gbo","PM",null,"TO03.HNN","Binnenriolering","Gerecycled PVC (Pipelife)","m2gbo","PM",null,"TO03.E","Binnenriolering","Gerecycled PVC (Pipelife)","m2gbo","PM"]
[null,null,null,"TO04.t","Hemelwaterafvoer","PVC","m1","PM",null,"TO04.HNN","Hemelwaterafvoer","Gerecycled PVC (Pipelife)","m1","PM",null,"TO04.E","Hemelwaterafvoer","Gerecycled PVC (Pipelife)","m1","PM"]
[null,null,null,"TO05.t","Dakgoot","Aluminium","m1",65,null,"TO05.HNN","Dakgoot","Aluminium","m1",65,null,"TO05.E","Dakgoot","Aluminium","m1",65]
[null,null,null,null,"Verkeersruimte",null,null,null,null,null,"Verkeersruimte",null,null,null,null,null,"Verkeersruimte"]
[null,null,null,"VE01.t","Interne trap","Eur. loofhout; geschilderd","st",1450,null,"VE01.HNN","Interne trap","Eur. loofhout; geschilderd","st",{"$f":"H138","v":1450},null,"VE01.E","Interne trap","Eur. loofhout; geschilderd","st",{"$f":"N138","v":1450}]
[null,null,null,"VE02.t","Centrale trap","Prefab beton","verd",5000,null,"VE02.HNN","Centrale trap","Prefab beton","verd",{"$f":"H139","v":5000},null,"VE02.E","Centrale trap","Prefab beton","verd",{"$f":"N139","v":5000}]
[null,null,null,"VE10.t","Centrale trap","Staal met Meranti treden","verd",7500,null,"VE10.HNN","Centrale trap","Staal met Meranti treden","st",{"$f":"H140","v":7500},null,"VE10.E","Centrale trap","Staal met Meranti treden","st",{"$f":"N140","v":7500}]
[null,null,null,"VE03.t","Balustrades","Eur. loofhout; spijlen; duurzame bosbouw","m1",125,null,"VE03.HNN","Balustrades","Eur. loofhout; spijlen; duurzame bosbouw","m1",125,null,"VE03.E","Balustrades","Eur. loofhout; spijlen; duurzame bosbouw","m1",125]
[null,null,null,"VE04.t","Balustrades","Aluminium; geanodiseerd","m1",300,null,"VE04.HNN","Balustrades","Aluminium; geanodiseerd","m1",300,null,"VE04.E","Balustrades","Aluminium; geanodiseerd","m1",300]
[null,null,null,"VE09.t","Balustrades","Staal; gepoedercoat; spijlen","m1",250,null,"VE09.HNN","Balustrades","Staal; gepoedercoat; spijlen","m1",{"$f":"H143","v":250},null,"VE09.E","Balustrades","Staal; gepoedercoat; spijlen","m1",{"$f":"N143","v":250}]
[null,null,null,"VE05.t","Leuningen","Eur. loofhout; duurzame bosbouw","m1",45,null,"VE05.HNN","Leuningen","Eur. loofhout; duurzame bosbouw","m1",45,null,"VE05.E","Leuningen","Eur. loofhout; duurzame bosbouw","m1",45]
[null,null,null,"VE06.t","Leuningen","Aluminium","m1",80,null,"VE06.HNN","Leuningen","Aluminium","m1",80,null,"VE06.E","Leuningen","Aluminium","m1",80]
[null,null,null,"VE07.t","Liftcabine","Staal; gemoffeld","st","liftcabine incl. inst.",null,"VE07.HNN","Liftcabine","Staal; gemoffeld","st","liftcabine incl. inst.",null,"VE07.E","Liftcabine","Staal; gemoffeld","st","liftcabine incl. inst."]
[null,null,null,"VE08.t","Liftinstallatie","Staal","verd",13500,null,"VE08.HNN","Liftinstallatie","Staal","verd",{"$f":"H147","v":13500},null,"VE08.E","Liftinstallatie","Staal","verd",{"$f":"N147","v":13500}]
[null,null,null,null,"Vaste voorzieningen",null,null,null,null,null,"Vaste voorzieningen",null,null,null,null,null,"Vaste voorzieningen"]
[null,null,null,"VA01.t","Toiletten; wandcloset + fontein","Porselein","st",{"$f":"(300+(4*60))+(150+(2.5*60))","v":840},null,"VA01.HNN","Toiletten; wandcloset + fontein","Porselein","st",{"$f":"H149","v":840},null,"VA01.E","Toiletten; wandcloset + fontein","Porselein","st",{"$f":"N149","v":840}]
[null,null,null,"VA02.t","Wastafel","Keramisch","st",{"$f":"(280+(3*60))","v":460},null,"VA02.HNN","Wastafel","Keramisch","st",{"$f":"H150","v":460},null,"VA02.E","Wastafel","Keramisch","st",{"$f":"N150","v":460}]
[null,null,null,"VA03.t","Inloopdouche","Gipsblokken + tegels incl. rvs afvoergoot","st",450,null,"VA03.HNN","Inloopdouche","Gipsblokken + tegels incl. rvs afvoergoot","st",{"$f":"H151","v":450},null,"VA03.E","Inloopdouche","Gipsblokken + tegels incl. rvs afvoergoot","st",450]
[null,null,null,null,"Overige kosten",null,null,null,null,null,"Overige kosten",null,null,null,null,null,"Overige kosten"]
[null,null,null,"OK01.t","Grondwerk, maatvoering, invoeren en sparingen",null,"BBO",35,null,"OK01.HNN",{"$f":"E153","v":"Grondwerk, maatvoering, invoeren en sparingen"},null,"BBO",{"$f":"H153","v":35},null,"OK01.E",{"$f":"E153","v":"Grondwerk, maatvoering, invoeren en sparingen"},null,"BBO",{"$f":"N153","v":35},"BBO"]
[null,null,null,"OK02.t","Gevelsteiger",null,"BGO",35,null,"OK02.HNN",{"$f":"E154","v":"Gevelsteiger"},null,"BGO",{"$f":"H154","v":35},null,"OK02.E",{"$f":"E154","v":"Gevelsteiger"},null,"BGO",{"$f":"N154","v":35},"BGO"]
[null,null,null,"OK03.t","Dakvalbeveiliging en inplakken van doorvoeren","Enkel bij appartementen","BDO",15,null,"OK03.HNN","Dakvalbeveiliging en inplakken van doorvoeren","Enkel bij appartementen","BDO",15,null,"OK03.E","Dakvalbeveiliging en inplakken van doorvoeren","Enkel bij appartementen","BDO",15,"BDO"]
[null,null,null,"OK04.t","Afbouwwerkzaamheden (klein timmerwerk, schilderwerk)",null,"BVO",10,null,"OK04.HNN","Afbouwwerkzaamheden (klein timmerwerk, schilderwerk)",null,"BVO",10,null,"OK04.E","Afbouwwerkzaamheden (klein timmerwerk, schilderwerk)",null,"BVO",10,"BVO"]
[null,null,null,"OK05.t","Bouwkundige voorzieningen ten behoeve van installaties",null,"BVO",15,null,"OK05.HNN","Bouwkundige voorzieningen ten behoeve van installaties",null,"BVO",15,null,"OK05.E","Bouwkundige voorzieningen ten behoeve van installaties",null,"BVO",15,"BVO"]
[null,null,null,"OK06.t","Installaties (E, W & klimaat) voor appartementen",null,"BVO",{"$f":"97+103+178","v":378},null,"OK06.HNN",{"$f":"E158","v":"Installaties (E, W & klimaat) voor appartementen"},null,"BVO",{"$f":"H158","v":378},null,"OK06.E",{"$f":"E158","v":"Installaties (E, W & klimaat) voor appartementen"},null,"BVO",{"$f":"N158","v":378},"BVO"]
[null,null,null,"OK06b.t","Installaties (E, W & klimaat) voor appartementen",null,"won",{"$f":"ROUND(((H158*W16)/AA16),0)","v":46701},null,"OK06b.HNN","Installaties (E, W & klimaat) voor appartementen",null,"won",{"$f":"H159","v":46701},null,"OK06b.E","Installaties (E, W & klimaat) voor appartementen",null,"won",{"$f":"N159","v":46701},"won"]
[null,null,null,"OK07.t","Installaties (E, W & klimaat) grondgebonden woning tussen",null,"BVO",260,null,"OK07.HNN","Installaties (E, W & klimaat) grondgebonden woning tussen",null,"BVO",{"$f":"H160","v":260},null,"OK07.E","Installaties (E, W & klimaat) grondgebonden woning tussen",null,"BVO",{"$f":"N160","v":260},"BVO"]
[null,null,null,"OK07b.t","Installaties (E, W & klimaat) grondgebonden woning tussen",null,"won",{"$f":"(H160*W12)/AA12","v":37960},null,"OK07b.HNN",{"$f":"E161","v":"Installaties (E, W & klimaat) grondgebonden woning tussen"},null,"won",{"$f":"H161","v":37960},null,"OK07b.E",{"$f":"E161","v":"Installaties (E, W & klimaat) grondgebonden woning tussen"},null,"won",{"$f":"N161","v":37960},"won"]
[null,null,null,"OK08.t","Installaties (E, W & klimaat) voor woontoren",null,"BVO",{"$f":"113+106+183","v":402},null,"OK08.HNN",{"$f":"E162","v":"Installaties (E, W & klimaat) voor woontoren"},null,"BVO",{"$f":"H162","v":402},null,"OK08.E",{"$f":"E162","v":"Installaties (E, W & klimaat) voor woontoren"},null,"BVO",{"$f":"N162","v":402},"BVO"]
[null,null,null,"OK08b.t","Installaties (E, W & klimaat) voor woontoren",null,"won",45000,null,"OK08b.HNN","Installaties (E, W & klimaat) voor woontoren",null,"won",45000,null,"OK08b.E","Installaties (E, W & klimaat) voor woontoren",null,"won",45000,"won"]
[null,null,null,"OK08c.t","Installaties (onderhoud) voor woontoren",null,"BVO",{"$f":"47","v":47},null,"OK08c.HNN",{"$f":"E164","v":"Installaties (onderhoud) voor woontoren"},null,"BVO",{"$f":"H164","v":47},null,"OK08c.E",{"$f":"E164","v":"Installaties (onderhoud) voor woontoren"},null,"BVO",{"$f":"N164","v":47},"BVO"]
[null,null,null,"OK09.t","Installaties (E, W & klimaat) woonschijf",null,"BVO",{"$f":"102+104+179","v":385},null,"OK09.HNN","Installaties (E, W & klimaat) woonschijf",null,"BVO",385,null,"OK09.E","Installaties (E, W & klimaat) woonschijf",null,"BVO",385,"BVO"]
[null,null,null,"OK09b.t","Installaties (E, W & klimaat) woonschijf",null,"won",{"$f":"ROUND(((H165*W20)/AA20),0)","v":34100},null,"OK09b.HNN",{"$f":"E166","v":"Installaties (E, W & klimaat) woonschijf"},null,"won",{"$f":"H166","v":34100},null,"OK09b.E",{"$f":"E166","v":"Installaties (E, W & klimaat) woonschijf"},null,"won",{"$f":"N166","v":34100},"won"]
[null,null,null,"OK10.t","Installaties (E, W & klimaat) grondgebonden woning hoek",null,"BVO",230,null,"OK10.HNN","Installaties (E, W & klimaat) grondgebonden woning hoek",null,"BVO",230,null,"OK10.E","Installaties (E, W & klimaat) grondgebonden woning hoek",null,"BVO",230,"BVO"]
[null,null,null,"OK10b.t","Installaties (E, W & klimaat) grondgebonden woning hoek",null,"won",{"$f":"(H167*W14)/AA14","v":41400},null,"OK10b.HNN","Installaties (E, W & klimaat) grondgebonden woning hoek",null,"won",41400,null,"OK10b.E","Installaties (E, W & klimaat) grondgebonden woning hoek",null,"won",41400,"won"]
[null,null,null,"OK11.t","Installaties (E, W & klimaat) gallerij",null,"BVO",{"$f":"98+71+175","v":344},null,"OK11.HNN","Installaties (E, W & klimaat) gallerij",null,"BVO",344,null,"OK11.E","Installaties (E, W & klimaat) gallerij",null,"BVO",344,"BVO"]
[null,null,null,"OK11b.t","Installaties (E, W & klimaat) gallerij",null,"won",{"$f":"ROUND(((H169*W23)/AA23),0)","v":29266},null,"OK11b.HNN","Installaties (E, W & klimaat) gallerij",null,"won",29266,null,"OK11b.E","Installaties (E, W & klimaat) gallerij",null,"won",29266,"won"]
[null,null,null,"OK12.t","Toeslag directe kosten woontoren",null,"BVO",0.05,null,"OK12.HNN","Toeslag directe kosten woontoren",null,"BVO",0.05,null,"OK12.E","Toeslag directe kosten woontoren",null,"BVO",0.05,"BVO"]
[null,null,null,"OK13.t","Toeslag ABK woontoren",null,"BVO",0.05,null,"OK13.HNN","Toeslag ABK woontoren",null,"BVO",0.05,null,"OK13.E","Toeslag ABK woontoren",null,"BVO",0.05,"BVO"]
[]
[null,null,null,null,"Exclusief keukens en terreinvoorzieningen",null,null,null,null,null,"Exclusief keukens en terreinvoorzieningen",null,null,null,null,null,"Exclusief keukens en terreinvoorzieningen"]
[]
[null,null,null,null,"Archetypes Amsterdam"]
[null,null,null,"ID","Fundering",null,null,null,null,"ID","Fundering",null,null,null,null,"ID","Fundering"]
[null,null,null,"A.FU01.t","Funderingsbalken, 400x500mm","In het werk gestort","m1",{"$f":"ROUND((0.4*0.5)*600,-0.1)","v":120},null,"A.FU01.HNN","Funderingsbalken, 400x500mm","Beton met 56% aan secundair aandeel (UMC)","m1",{"$f":"ROUND((0.4*0.5)*650,-0.1)","v":130},null,"A.FU01.E","Funderingsbalken, 400x500mm","Beton met 56% aan secundair aandeel (UMC)","m1",{"$f":"N178","v":130}]
[null,null,null,"A.FU02.t","Funderingsbalken, 600x600mm","In het werk gestort","m1",{"$f":"ROUND((0.6*0.6)*600,-0.1)+4","v":220},null,"A.FU02.HNN","Funderingsbalken, 600x600mm","Beton met 56% aan secundair aandeel (UMC)","m1",{"$f":"ROUND((0.6*0.6)*650,-0.1)","v":234},null,"A.FU02.E","Funderingsbalken, 600x600mm","Beton met 56% aan secundair aandeel (UMC)","m1",{"$f":"N179","v":234}]
[null,null,null,"A.FU03.t","Funderingspaal, ⌀ 350mm; l=15,0m","Schroefpaal; beton, in het werk gestort, C20/25,CEMIII; incl.wapening","m1",60,null,"A.FU03.HNN","Funderingspaal, ⌀ 350mm; l=15,0m","Beton met 56% aan secundair aandeel (UMC)","m1",{"$f":"H180+5","v":65},null,"A.FU03.E","Funderingspaal, ⌀ 350mm; l=15,0m","Beton met 56% aan secundair aandeel (UMC)","m1",{"$f":"N180","v":65}]
[null,null,null,"A.FU04.t","Funderingspaal, ⌀ 500mm; l=25,0m","Schroefpaal; beton, in het werk gestort, C20/25,CEMIII; incl.wapening","m1",80,null,"A.FU04.HNN","Funderingspaal, ⌀ 500mm; l=25,0m","Beton met 56% aan secundair aandeel (UMC)","m1",{"$f":"H181+5","v":85},null,"A.FU04.E","Funderingspaal, ⌀ 500mm; l=25,0m","Beton met 56% aan secundair aandeel (UMC)","m1",{"$f":"N181","v":85}]
[null,null,null,null,"Vloeren",null,null,null,null,null,"Vloeren",null,null,null,null,null,"Vloeren"]
[null,null,null,"A.VL01.t","Toeslag isolatie BG-vloer van Rc 3,7 naar Rc 5,0","Kanaalplaatvloer; prefab beton","m2",10,null,"A.VL01.HNN","Toeslag isolatie BG-vloer van Rc 3,7 naar Rc 5,0","Kanaalplaat, remontabel (28% recyclaat)","m2",10,null,"A.VL01.E","Toeslag isolatie BG-vloer van Rc 3,7 naar Rc 5,0","Kanaalplaat, remontabel (28% recyclaat)","m2",{"$f":"N183","v":10}]
[null,null,null,null,"Gevel",null,null,null,null,null,"Gevel",null,null,null,null,null,"Gevel"]
[null,null,null,"A.GE01.t","Toeslag isolatie in gevel van Rc 4,5 naar Rc 6,0","Glaswolplaten, MWA 2012","m2",15,null,"A.GE01.HNN","Toeslag isolatie in gevel van Rc 4,5 naar Rc 6,0","Isovlas plaat","m2",20,null,"A.GE01.E","Toeslag isolatie in gevel van Rc 4,5 naar Rc 6,0","Isovlas plaat, PN160mm","m2",20]
[null,null,null,null,"Daken",null,null,null,null,null,"Daken",null,null,null,null,null,"Daken"]
[null,null,null,"A.DA01.t","Toeslag isolatie op dak van Rc 6,0 naar Rc 8,0","EPS","m2",20,null,"A.DA01.HNN","Toeslag isolatie op dak van Rc 6,0 naar Rc 8,0","Houtvezel vlakke isolatieplaten","m2",25,null,"A.DA01.E","Toeslag isolatie op dak van Rc 6,0 naar Rc 8,0","Houtvezel vlakke isolatieplaten","m2",25]

{"sheet":"Maatregelen nieuwbouw","index":1,"n_rows":659,"n_cols":14,"rows_kept":659,"cut":false,"hidden":false,"merged":[[28,4,28,5],[28,8,28,9],[28,12,28,13],[32,4,32,5],[32,8,32,9],[32,12,32,13],[25,4,25,5],[25,8,25,9],[25,12,25,13],[26,4,27,4],[26,5,27,5],[26,8,27,8],[26,9,27,9],[26,12,27,12],[26,13,27,13],[62,4,62,5],[62,8,62,9],[62,12,62,13],[68,4,68,5],[68,8,68,9],[68,12,68,13],[39,4,39,5],[39,8,39,9],[39,12,39,13],[49,4,49,5],[49,8,49,9],[49,12,49,13],[81,4,81,5],[81,8,81,9],[81,12,81,13],[85,4,85,5],[85,8,85,9],[85,12,85,13],[71,4,71,5],[71,8,71,9],[71,12,71,13],[77,4,77,5],[77,8,77,9],[77,12,77,13],[88,4,88,5],[88,8,88,9],[88,12,88,13],[89,4,89,5],[89,8,89,9],[89,12,89,13],[86,4,86,5],[86,8,86,9],[86,12,86,13],[87,4,87,5],[87,8,87,9],[87,12,87,13],[110,4,110,5],[110,8,110,9],[110,12,110,13],[114,4,114,5],[114,8,114,9],[114,12,114,13],[107,4,107,5],[107,8,107,9],[107,12,107,13],[108,4,109,4],[108,5,109,5],[108,8,109,8],[108,9,109,9],[108,12,109,12],[108,13,109,13],[135,4,135,5],[135,8,135,9],[135,12,135,13],[144,4,144,5],[144,8,144,9],[144,12,144,13],[121,4,121,5],[121,8,121,9],[121,12,121,13],[131,4,131,5],[131,8,131,9],[131,12,131,13],[158,4,158,5],[158,8,158,9],[158,12,158,13],[162,4,162,5],[162,8,162,9],[162,12,162,13],[149,4,149,5],[149,8,149,9],[149,12,149,13],[152,4,152,5],[152,8,152,9],[152,12,152,13],[168,4,168,5],[168,8,168,9],[168,12,168,13],[169,4,169,5],[169,8,169,9],[169,12,169,13],[166,4,166,5],[166,8,166,9],[166,12,166,13],[167,4,167,5],[167,8,167,9],[167,12,167,13],[190,4,191,4],[190,5,191,5],[190,8,191,8],[190,9,191,9],[190,12,191,12],[190,13,191,13],[170,4,170,5],[170,8,170,9],[170,12,170,13],[189,4,189,5],[189,8,189,9],[189,12,189,13],[204,4,204,5],[204,8,204,9],[204,12,204,13],[206,4,206,5],[206,8,206,9],[206,12,206,13],[192,4,192,5],[192,8,192,9],[192,12,192,13],[197,4,197,5],[197,8,197,9],[197,12,197,13],[228,4,228,5],[228,8,228,9],[228,12,228,13],[235,4,235,5],[235,8,235,9],[235,12,235,13],[215,4,215,5],[215,8,215,9],[215,12,215,13],[221,4,221,5],[221,8,221,9],[221,12,221,13],[247,4,247,5],[247,8,247,9],[247,12,247,13],[251,4,251,5],[251,8,251,9],[251,12,251,13],[238,4,238,5],[238,8,238,9],[238,12,238,13],[243,4,243,5],[243,8,243,9],[243,12,243,13],[254,4,254,5],[254,8,254,9],[254,12,254,13],[255,4,255,5],[255,8,255,9],[255,12,255,13],[252,4,252,5],[252,8,252,9],[252,12,252,13],[253,4,253,5],[253,8,253,9],[253,12,253,13],[277,4,277,5],[277,8,277,9],[277,12,277,13],[281,4,281,5],[281,8,281,9],[281,12,281,13],[274,4,274,5],[274,8,274,9],[274,12,274,13],[275,4,276,4],[275,5,276,5],[275,8,276,8],[275,9,276,9],[275,12,276,12],[275,13,276,13],[306,4,306,5],[306,8,306,9],[306,12,306,13],[315,4,315,5],[315,8,315,9],[315,12,315,13],[290,4,290,5],[290,8,290,9],[290,12,290,13],[300,4,300,5],[300,8,300,9],[300,12,300,13],[330,4,330,5],[330,8,330,9],[330,12,330,13],[335,4,335,5],[335,8,335,9],[335,12,335,13],[321,4,321,5],[321,8,321,9],[321,12,321,13],[325,4,325,5],[325,8,325,9],[325,12,325,13],[341,4,341,5],[341,8,341,9],[341,12,341,13],[342,4,342,5],[342,8,342,9],[342,12,342,13],[339,4,339,5],[339,8,339,9],[339,12,339,13],[340,4,340,5],[340,8,340,9],[340,12,340,13],[345,4,345,5],[345,8,345,9],[345,12,345,13],[364,4,364,5],[364,8,364,9],[364,12,364,13],[343,4,343,5],[343,8,343,9],[343,12,343,13],[344,4,344,5],[344,8,344,9],[344,12,344,13],[367,4,367,5],[367,8,367,9],[367,12,367,13],[372,4,372,5],[372,8,372,9],[372,12,372,13],[365,4,366,4],[365,5,366,5],[365,8,366,8],[365,9,366,9],[365,12,366,12],[365,13,366,13],[399,4,399,5],[399,8,399,9],[399,12,399,13],[408,4,408,5],[408,8,408,9],[408,12,408,13],[382,4,382,5],[382,8,382,9],[382,12,382,13],[386,4,386,5],[386,8,386,9],[386,12,386,13],[431,4,431,5],[431,8,431,9],[431,12,431,13],[436,4,436,5],[436,8,436,9],[436,12,436,13],[420,4,420,5],[420,8,420,9],[420,12,420,13],[427,4,427,5],[427,8,427,9],[427,12,427,13],[446,4,446,5],[446,8,446,9],[446,12,446,13],[447,4,447,5],[447,8,447,9],[447,12,447,13],[441,4,441,5],[441,8,441,9],[441,12,441,13],[445,4,445,5],[445,8,445,9],[445,12,445,13],[450,4,450,5],[450,8,450,9],[450,12,450,13],[451,4,451,5],[451,8,451,9],[451,12,451,13],[448,4,448,5],[448,8,448,9],[448,12,448,13],[449,4,449,5],[449,8,449,9],[449,12,449,13],[469,4,469,5],[469,8,469,9],[469,12,469,13],[470,4,471,4],[470,5,471,5],[470,8,471,8],[470,9,471,9],[470,12,471,12],[470,13,471,13],[490,8,490,9],[490,12,490,13],[502,8,502,9],[502,12,502,13],[511,8,511,9],[511,12,511,13],[472,4,472,5],[472,8,472,9],[472,12,472,13],[477,8,477,9],[477,12,477,13],[486,8,486,9],[486,12,486,13],[542,8,542,9],[542,12,542,13],[547,8,547,9],[547,12,547,13],[551,8,551,9],[551,12,551,13],[526,8,526,9],[526,12,526,13],[533,8,533,9],[533,12,533,13],[537,8,537,9],[537,12,537,13],[554,4,554,5],[554,8,554,9],[554,12,554,13],[555,4,555,5],[555,8,555,9],[555,12,555,13],[552,4,552,5],[552,8,552,9],[552,12,552,13],[553,4,553,5],[553,8,553,9],[553,12,553,13],[558,4,558,5],[558,8,558,9],[558,12,558,13],[559,4,559,5],[559,8,559,9],[559,12,559,13],[556,4,556,5],[556,8,556,9],[556,12,556,13],[557,4,557,5],[557,8,557,9],[557,12,557,13],[579,4,579,5],[579,8,579,9],[579,12,579,13],[584,4,584,5],[584,8,584,9],[584,12,584,13],[576,4,576,5],[576,8,576,9],[576,12,576,13],[577,4,578,4],[577,5,578,5],[577,8,578,8],[577,9,578,9],[577,12,578,12],[577,13,578,13],[609,4,609,5],[609,8,609,9],[609,12,609,13],[618,4,618,5],[618,8,618,9],[618,12,618,13],[593,4,593,5],[593,8,593,9],[593,12,593,13],[597,4,597,5],[597,8,597,9],[597,12,597,13],[637,4,637,5],[637,8,637,9],[637,12,637,13],[642,4,642,5],[642,8,642,9],[642,12,642,13],[627,4,627,5],[627,8,627,9],[627,12,627,13],[633,4,633,5],[633,8,633,9],[633,12,633,13],[653,4,653,5],[653,8,653,9],[653,12,653,13],[654,4,654,5],[654,8,654,9],[654,12,654,13],[648,4,648,5],[648,8,648,9],[648,12,648,13],[652,4,652,5],[652,8,652,9],[652,12,652,13],[657,4,657,5],[657,8,657,9],[657,12,657,13],[658,4,658,5],[658,8,658,9],[658,12,658,13],[655,4,655,5],[655,8,655,9],[655,12,655,13],[656,4,656,5],[656,8,656,9],[656,12,656,13]]}
[]
[]
[]
[null,null,null,null,"Titel","Maatregelen circulaire nieuwbouw, Versnellingslab"]
[null,null,null,null,"Versie","1.0"]
[null,null,null,null,"Datum ","2023-05-10"]
[]
[]
[]
[null,null,null,null,"Traditioneel",null,null,null,"Het Nieuwe Normaal",null,null,null,"Het Nieuwe Normaal ambitieus"]
[]
[null,null,null,null,"WONEN",null,null,null,"WONEN",null,null,null,"WONEN"]
[]
[]
[]
[]
[]
[]
[null,null,null,null,null,null,null,{"$f":"0.696-I19","v":0.61049999999999993},{"$f":"0.095-0.0095","v":8.5500000000000007E-2}]
[]
[]
[]
[]
[]
[]
[null,null,null,null,"Woning S tussen",null,null,null,"Woning S tussen",null,null,null,"Woning S tussen"]
[null,null,null,null,"Element","Materialisatie",null,null,"Element","Materialisatie",null,null,"Element","Materialisatie"]
[]
[null,null,null,null,"Fundering",null,null,null,"Fundering",null,null,null,"Fundering"]
[null,null,null,"FU03.t",{"$f":"VLOOKUP(D30,'Input Wonen'!$D$13:$H$151,2,FALSE)","v":"Funderingspaal, ⌀ 300mm; l=15,0m"},{"$f":"VLOOKUP(D30,'Input Wonen'!$D$13:$H$151,3,FALSE)","v":"Schroefpaal; beton, in het werk gestort, C20/25,CEMIII; incl.wapening"},null,"FU03.HNN",{"$f":"IFERROR(VLOOKUP(H30,'Input Wonen'!$J$13:$N$151,COLUMNS('Input Wonen'!J:K),FALSE),\"\")","v":"Funderingspaal, ⌀ 300mm; l=15,0m"},{"$f":"IFERROR(VLOOKUP(H30,'Input Wonen'!$J$13:$N$151,COLUMNS('Input Wonen'!J:L),FALSE),\"\")","v":"Beton met 56% aan secundair aandeel (UMC)"},null,"FU03.E",{"$f":"IFERROR(VLOOKUP(L30,'Input Wonen'!$P$13:$T$151,COLUMNS('Input Wonen'!P:Q),FALSE),\"\")","v":"Funderingspaal, ⌀ 300mm; l=15,0m"},{"$f":"IFERROR(VLOOKUP(L30,'Input Wonen'!$P$13:$T$151,COLUMNS('Input Wonen'!P:R),FALSE),\"\")","v":"Beton met 56% aan secundair aandeel (UMC)"}]
[null,null,null,"FU02.t",{"$f":"VLOOKUP(D31,'Input Wonen'!$D$13:$H$151,2,FALSE)","v":"Funderingsbalken, 400x500mm"},{"$f":"VLOOKUP(D31,'Input Wonen'!$D$13:$H$151,3,FALSE)","v":"In het werk gestort"},null,"FU02.HNN",{"$f":"IFERROR(VLOOKUP(H31,'Input Wonen'!$J$13:$N$151,COLUMNS('Input Wonen'!J:K),FALSE),\"\")","v":"Funderingsbalken, 400x500mm"},{"$f":"IFERROR(VLOOKUP(H31,'Input Wonen'!$J$13:$N$151,COLUMNS('Input Wonen'!J:L),FALSE),\"\")","v":"Beton met 56% aan secundair aandeel (UMC)"},null,"FU02.E",{"$f":"IFERROR(VLOOKUP(L31,'Input Wonen'!$P$13:$T$151,COLUMNS('Input Wonen'!P:Q),FALSE),\"\")","v":"Funderingsbalken, 400x500mm"},{"$f":"IFERROR(VLOOKUP(L31,'Input Wonen'!$P$13:$T$151,COLUMNS('Input Wonen'!P:R),FALSE),\"\")","v":"Beton met 56% aan secundair aandeel (UMC)"}]
[null,null,null,"FU05.t",{"$f":"VLOOKUP(D32,'Input Wonen'!$D$13:$H$151,2,FALSE)","v":"Bodemafsluiting, zand"},{"$f":"VLOOKUP(D32,'Input Wonen'!$D$13:$H$151,3,FALSE)","v":"Zand"},null,"FU05.HNN",{"$f":"IFERROR(VLOOKUP(H32,'Input Wonen'!$J$13:$N$151,COLUMNS('Input Wonen'!J:K),FALSE),\"\")","v":"Bodemafsluiting, 100 zand"},{"$f":"IFERROR(VLOOKUP(H32,'Input Wonen'!$J$13:$N$151,COLUMNS('Input Wonen'!J:L),FALSE),\"\")","v":"Zand"},null,"FU05.E",{"$f":"IFERROR(VLOOKUP(L32,'Input Wonen'!$P$13:$T$151,COLUMNS('Input Wonen'!P:Q),FALSE),\"\")","v":"Bodemafsluiting, 100 zand"},{"$f":"IFERROR(VLOOKUP(L32,'Input Wonen'!$P$13:$T$151,COLUMNS('Input Wonen'!P:R),FALSE),\"\")","v":"Zand"}]
[null,null,null,null,"Vloeren",null,null,null,"Vloeren",null,null,null,"Vloeren"]
[null,null,null,"VL01.t",{"$f":"VLOOKUP(D34,'Input Wonen'!$D$13:$H$151,2,FALSE)","v":"BG: ribbenvloer, vrijdragend incl. isolatie (Rc=3,7)"},{"$f":"VLOOKUP(D34,'Input Wonen'!$D$13:$H$151,3,FALSE)","v":"Prefab beton"},null,"VL01.HNN",{"$f":"IFERROR(VLOOKUP(H34,'Input Wonen'!$J$13:$N$151,COLUMNS('Input Wonen'!J:K),FALSE),\"\")","v":"BG: kanaalplaatvloer, 200mm incl. isolatie (Rc=3,7)"},{"$f":"IFERROR(VLOOKUP(H34,'Input Wonen'!$J$13:$N$151,COLUMNS('Input Wonen'!J:L),FALSE),\"\")","v":"Kanaalplaat, remontabel (28% recyclaat)"},null,"VL01.E",{"$f":"IFERROR(VLOOKUP(L34,'Input Wonen'!$P$13:$T$151,COLUMNS('Input Wonen'!P:Q),FALSE),\"\")","v":"BG: kanaalplaatvloer, 200mm incl. isolatie (Rc=3,7)"},{"$f":"IFERROR(VLOOKUP(L34,'Input Wonen'!$P$13:$T$151,COLUMNS('Input Wonen'!P:R),FALSE),\"\")","v":"Kanaalplaat, remontabel (28% recyclaat)"}]
[null,null,null,"VL02.t",{"$f":"VLOOKUP(D35,'Input Wonen'!$D$13:$H$151,2,FALSE)","v":"Dekvloeren, 60mm"},{"$f":"VLOOKUP(D35,'Input Wonen'!$D$13:$H$151,3,FALSE)","v":"Zandcement dekvloer"},null,"VL02.HNN",{"$f":"IFERROR(VLOOKUP(H35,'Input Wonen'!$J$13:$N$151,COLUMNS('Input Wonen'!J:K),FALSE),\"\")","v":"Dekvloeren, 60mm"},{"$f":"IFERROR(VLOOKUP(H35,'Input Wonen'!$J$13:$N$151,COLUMNS('Input Wonen'!J:L),FALSE),\"\")","v":"Fermacell honingraatvloer (op houten vloer)"},null,"VL02.E",{"$f":"IFERROR(VLOOKUP(L35,'Input Wonen'!$P$13:$T$151,COLUMNS('Input Wonen'!P:Q),FALSE),\"\")","v":"Dekvloeren, 60mm"},{"$f":"IFERROR(VLOOKUP(L35,'Input Wonen'!$P$13:$T$151,COLUMNS('Input Wonen'!P:R),FALSE),\"\")","v":"Fermacell honingraatvloer (op houten vloer)"}]
[null,null,null,"VL03.t",{"$f":"VLOOKUP(D36,'Input Wonen'!$D$13:$H$151,2,FALSE)","v":"Vloertegelwerk toilet"},{"$f":"VLOOKUP(D36,'Input Wonen'!$D$13:$H$151,3,FALSE)","v":"Keramische tegels, geglazuurd/gelijmd"},null,"VL03.HNN",{"$f":"IFERROR(VLOOKUP(H36,'Input Wonen'!$J$13:$N$151,COLUMNS('Input Wonen'!J:K),FALSE),\"\")","v":"Vloertegelwerk toilet"},{"$f":"IFERROR(VLOOKUP(H36,'Input Wonen'!$J$13:$N$151,COLUMNS('Input Wonen'!J:L),FALSE),\"\")","v":"Mosa C2C vloertegels"},null,"VL03.E",{"$f":"IFERROR(VLOOKUP(L36,'Input Wonen'!$P$13:$T$151,COLUMNS('Input Wonen'!P:Q),FALSE),\"\")","v":"Vloertegelwerk toilet"},{"$f":"IFERROR(VLOOKUP(L36,'Input Wonen'!$P$13:$T$151,COLUMNS('Input Wonen'!P:R),FALSE),\"\")","v":"Mosa C2C vloertegels (losmaakbaar)"}]
[null,null,null,"VL20.t",{"$f":"VLOOKUP(D37,'Input Wonen'!$D$13:$H$151,2,FALSE)","v":"VV: kanaalplaatvloer, 200mm"},{"$f":"VLOOKUP(D37,'Input Wonen'!$D$13:$H$151,3,FALSE)","v":"Kanaalplaatvloer; prefab beton"},null,"VL20.HNN",{"$f":"IFERROR(VLOOKUP(H37,'Input Wonen'!$J$13:$N$151,COLUMNS('Input Wonen'!J:K),FALSE),\"\")","v":"VV: kanaalplaatvloer, 200mm"},{"$f":"IFERROR(VLOOKUP(H37,'Input Wonen'!$J$13:$N$151,COLUMNS('Input Wonen'!J:L),FALSE),\"\")","v":"Kanaalplaatvloer, 200mm (28% recyclaat)"},null,"VL20.E",{"$f":"IFERROR(VLOOKUP(L37,'Input Wonen'!$P$13:$T$151,COLUMNS('Input Wonen'!P:Q),FALSE),\"\")","v":"VV: HSB (grondgeb.) "},{"$f":"IFERROR(VLOOKUP(L37,'Input Wonen'!$P$13:$T$151,COLUMNS('Input Wonen'!P:R),FALSE),\"\")","v":"HSB vloerelement (stijlen+OSB), 18mm; IsoVlas 60mm; gipsplaat (2x)"}]
[null,null,null,"VL07.t",{"$f":"VLOOKUP(D38,'Input Wonen'!$D$13:$H$151,2,FALSE)","v":"Dekvloeren, 60mm"},{"$f":"VLOOKUP(D38,'Input Wonen'!$D$13:$H$151,3,FALSE)","v":"Zandcement dekvloer"},null,"VL07.HNN",{"$f":"IFERROR(VLOOKUP(H38,'Input Wonen'!$J$13:$N$151,COLUMNS('Input Wonen'!J:K),FALSE),\"\")","v":"Dekvloeren, 60mm"},{"$f":"IFERROR(VLOOKUP(H38,'Input Wonen'!$J$13:$N$151,COLUMNS('Input Wonen'!J:L),FALSE),\"\")","v":"Fermacell honingraatvloer (op houten vloer)"},null,"VL07.E",{"$f":"IFERROR(VLOOKUP(L38,'Input Wonen'!$P$13:$T$151,COLUMNS('Input Wonen'!P:Q),FALSE),\"\")","v":"Dekvloeren, 60mm"},{"$f":"IFERROR(VLOOKUP(L38,'Input Wonen'!$P$13:$T$151,COLUMNS('Input Wonen'!P:R),FALSE),\"\")","v":"Fermacell honingraatvloer (op houten vloer)"}]
[null,null,null,"VL04.t",{"$f":"VLOOKUP(D39,'Input Wonen'!$D$13:$H$151,2,FALSE)","v":"Vloertegelwerk badkamer"},{"$f":"VLOOKUP(D39,'Input Wonen'!$D$13:$H$151,3,FALSE)","v":"Keramische tegels, geglazuurd/gelijmd"},null,"VL04.HNN",{"$f":"IFERROR(VLOOKUP(H39,'Input Wonen'!$J$13:$N$151,COLUMNS('Input Wonen'!J:K),FALSE),\"\")","v":"Vloertegelwerk badkamer"},{"$f":"IFERROR(VLOOKUP(H39,'Input Wonen'!$J$13:$N$151,COLUMNS('Input Wonen'!J:L),FALSE),\"\")","v":"Mosa C2C vloertegels"},null,"VL04.E",{"$f":"IFERROR(VLOOKUP(L39,'Input Wonen'!$P$13:$T$151,COLUMNS('Input Wonen'!P:Q),FALSE),\"\")","v":"Vloertegelwerk badkamer"},{"$f":"IFERROR(VLOOKUP(L39,'Input Wonen'!$P$13:$T$151,COLUMNS('Input Wonen'!P:R),FALSE),\"\")","v":"Mosa C2C vloertegels (losmaakbaar)"}]
[null,null,null,null,"Gevel",null,null,null,"Gevel",null,null,null,"Gevel"]
[null,null,null,"GE50.t",{"$f":"VLOOKUP(D41,'Input Wonen'!$D$13:$H$151,2,FALSE)","v":"Gevelkozijnen; incl. HR++ beglazing"},{"$f":"VLOOKUP(D41,'Input Wonen'!$D$13:$H$151,3,FALSE)","v":"Az. loofhout (Meranti), geschilderd"},null,"GE50.HNN",{"$f":"IFERROR(VLOOKUP(H41,'Input Wonen'!$J$13:$N$151,COLUMNS('Input Wonen'!J:K),FALSE),\"\")","v":"Gevelkozijnen; incl. HR++ beglazing"},{"$f":"IFERROR(VLOOKUP(H41,'Input Wonen'!$J$13:$N$151,COLUMNS('Input Wonen'!J:L),FALSE),\"\")","v":"Europees naaldhout, geschilderd"},null,"GE50.E",{"$f":"IFERROR(VLOOKUP(L41,'Input Wonen'!$P$13:$T$151,COLUMNS('Input Wonen'!P:Q),FALSE),\"\")","v":"Gevelkozijnen; incl. Isomax beglazing"},{"$f":"IFERROR(VLOOKUP(L41,'Input Wonen'!$P$13:$T$151,COLUMNS('Input Wonen'!P:R),FALSE),\"\")","v":"Europees naaldhout, geschilderd"}]
[null,null,null,"GE03.t",{"$f":"VLOOKUP(D42,'Input Wonen'!$D$13:$H$151,2,FALSE)","v":"Stelkozijnen"},{"$f":"VLOOKUP(D42,'Input Wonen'!$D$13:$H$151,3,FALSE)","v":"Onverduurzaamd hout, geverfd"},null,"GE03.HNN",{"$f":"IFERROR(VLOOKUP(H42,'Input Wonen'!$J$13:$N$151,COLUMNS('Input Wonen'!J:K),FALSE),\"\")","v":"Stelkozijnen"},{"$f":"IFERROR(VLOOKUP(H42,'Input Wonen'!$J$13:$N$151,COLUMNS('Input Wonen'!J:L),FALSE),\"\")","v":"Onverduurzaamd hout, geverfd"},null,"GE03.E",{"$f":"IFERROR(VLOOKUP(L42,'Input Wonen'!$P$13:$T$151,COLUMNS('Input Wonen'!P:Q),FALSE),\"\")","v":"Stelkozijnen"},{"$f":"IFERROR(VLOOKUP(L42,'Input Wonen'!$P$13:$T$151,COLUMNS('Input Wonen'!P:R),FALSE),\"\")","v":"Onverduurzaamd hout, geverfd"}]
[null,null,null,"GE04.t",{"$f":"VLOOKUP(D43,'Input Wonen'!$D$13:$H$151,2,FALSE)","v":"Vensterbanken"},{"$f":"VLOOKUP(D43,'Input Wonen'!$D$13:$H$151,3,FALSE)","v":"Composietsteen "},null,"GE04.HNN",{"$f":"IFERROR(VLOOKUP(H43,'Input Wonen'!$J$13:$N$151,COLUMNS('Input Wonen'!J:K),FALSE),\"\")","v":"Vensterbanken"},{"$f":"IFERROR(VLOOKUP(H43,'Input Wonen'!$J$13:$N$151,COLUMNS('Input Wonen'!J:L),FALSE),\"\")","v":"Composietsteen"},null,"GE04.E",{"$f":"IFERROR(VLOOKUP(L43,'Input Wonen'!$P$13:$T$151,COLUMNS('Input Wonen'!P:Q),FALSE),\"\")","v":"Vensterbanken"},{"$f":"IFERROR(VLOOKUP(L43,'Input Wonen'!$P$13:$T$151,COLUMNS('Input Wonen'!P:R),FALSE),\"\")","v":"Composietsteen"}]
[null,null,null,"GE05.t",{"$f":"VLOOKUP(D44,'Input Wonen'!$D$13:$H$151,2,FALSE)","v":"Waterslagen"},{"$f":"VLOOKUP(D44,'Input Wonen'!$D$13:$H$151,3,FALSE)","v":"Prefab beton"},null,"GE05.HNN",{"$f":"IFERROR(VLOOKUP(H44,'Input Wonen'!$J$13:$N$151,COLUMNS('Input Wonen'!J:K),FALSE),\"\")","v":"Waterslagen"},{"$f":"IFERROR(VLOOKUP(H44,'Input Wonen'!$J$13:$N$151,COLUMNS('Input Wonen'!J:L),FALSE),\"\")","v":"Prefab beton"},null,"GE05.E",{"$f":"IFERROR(VLOOKUP(L44,'Input Wonen'!$P$13:$T$151,COLUMNS('Input Wonen'!P:Q),FALSE),\"\")","v":"Waterslagen"},{"$f":"IFERROR(VLOOKUP(L44,'Input Wonen'!$P$13:$T$151,COLUMNS('Input Wonen'!P:R),FALSE),\"\")","v":"Prefab beton"}]
[null,null,null,"GE22.t",{"$f":"VLOOKUP(D45,'Input Wonen'!$D$13:$H$151,2,FALSE)","v":"Lateien"},{"$f":"VLOOKUP(D45,'Input Wonen'!$D$13:$H$151,3,FALSE)","v":"Prefab beton"},null,"GE22.HNN",{"$f":"IFERROR(VLOOKUP(H45,'Input Wonen'!$J$13:$N$151,COLUMNS('Input Wonen'!J:K),FALSE),\"\")","v":"Lateien"},{"$f":"IFERROR(VLOOKUP(H45,'Input Wonen'!$J$13:$N$151,COLUMNS('Input Wonen'!J:L),FALSE),\"\")","v":"Prefab beton"},null,"GE22.E",{"$f":"IFERROR(VLOOKUP(L45,'Input Wonen'!$P$13:$T$151,COLUMNS('Input Wonen'!P:Q),FALSE),\"\")","v":"Lateien"},{"$f":"IFERROR(VLOOKUP(L45,'Input Wonen'!$P$13:$T$151,COLUMNS('Input Wonen'!P:R),FALSE),\"\")","v":"Prefab beton"}]
[null,null,null,"GE08.t",{"$f":"VLOOKUP(D46,'Input Wonen'!$D$13:$H$151,2,FALSE)","v":"Buitendeur; incl. glasopening 0,85m2"},{"$f":"VLOOKUP(D46,'Input Wonen'!$D$13:$H$151,3,FALSE)","v":"Onverduurzaamd hout, geverfd"},null,"GE08.HNN",{"$f":"IFERROR(VLOOKUP(H46,'Input Wonen'!$J$13:$N$151,COLUMNS('Input Wonen'!J:K),FALSE),\"\")","v":"Buitendeur; incl. glasopening 0,85m2"},{"$f":"IFERROR(VLOOKUP(H46,'Input Wonen'!$J$13:$N$151,COLUMNS('Input Wonen'!J:L),FALSE),\"\")","v":"Onverduurzaamd hout, geverfd"},null,"GE08.E",{"$f":"IFERROR(VLOOKUP(L46,'Input Wonen'!$P$13:$T$151,COLUMNS('Input Wonen'!P:Q),FALSE),\"\")","v":"Buitendeur; incl. glasopening 0,85m2"},{"$f":"IFERROR(VLOOKUP(L46,'Input Wonen'!$P$13:$T$151,COLUMNS('Input Wonen'!P:R),FALSE),\"\")","v":"Onverduurzaamd hout, geverfd"}]
[null,null,null,"GE09.t",{"$f":"VLOOKUP(D47,'Input Wonen'!$D$13:$H$151,2,FALSE)","v":"Buitenspouwblad, 100mm"},{"$f":"VLOOKUP(D47,'Input Wonen'!$D$13:$H$151,3,FALSE)","v":"Baksteenmetselwerk"},null,"GE09.HNN",{"$f":"IFERROR(VLOOKUP(H47,'Input Wonen'!$J$13:$N$151,COLUMNS('Input Wonen'!J:K),FALSE),\"\")","v":"Buitenspouwblad"},{"$f":"IFERROR(VLOOKUP(H47,'Input Wonen'!$J$13:$N$151,COLUMNS('Input Wonen'!J:L),FALSE),\"\")","v":"Ecobrick Wienerberger"},null,"GE09.E",{"$f":"IFERROR(VLOOKUP(L47,'Input Wonen'!$P$13:$T$151,COLUMNS('Input Wonen'!P:Q),FALSE),\"\")","v":"Buitenspouwblad"},{"$f":"IFERROR(VLOOKUP(L47,'Input Wonen'!$P$13:$T$151,COLUMNS('Input Wonen'!P:R),FALSE),\"\")","v":"Houten gevelbekleding; Meranti delen"}]
[null,null,null,"GE10.t",{"$f":"VLOOKUP(D48,'Input Wonen'!$D$13:$H$151,2,FALSE)","v":"Isolatielagen, Rc=4,7"},{"$f":"VLOOKUP(D48,'Input Wonen'!$D$13:$H$151,3,FALSE)","v":"PUR/PIR schuimplaten"},null,"GE10.HNN",{"$f":"IFERROR(VLOOKUP(H48,'Input Wonen'!$J$13:$N$151,COLUMNS('Input Wonen'!J:K),FALSE),\"\")","v":"Isolatielagen, Rc=4,7"},{"$f":"IFERROR(VLOOKUP(H48,'Input Wonen'!$J$13:$N$151,COLUMNS('Input Wonen'!J:L),FALSE),\"\")","v":"Isovlas plaat, PN160mm"},null,"GE10.E",{"$f":"IFERROR(VLOOKUP(L48,'Input Wonen'!$P$13:$T$151,COLUMNS('Input Wonen'!P:Q),FALSE),\"\")","v":"Isolatielagen, Rc=4,7"},{"$f":"IFERROR(VLOOKUP(L48,'Input Wonen'!$P$13:$T$151,COLUMNS('Input Wonen'!P:R),FALSE),\"\")","v":"Isovlas plaat, PN160mm"}]
[null,null,null,"GE11.t",{"$f":"VLOOKUP(D49,'Input Wonen'!$D$13:$H$151,2,FALSE)","v":"Binnenspouwblad, 100mm (bruto)"},{"$f":"VLOOKUP(D49,'Input Wonen'!$D$13:$H$151,3,FALSE)","v":"Prefab beton"},null,"GE11.HNN",{"$f":"IFERROR(VLOOKUP(H49,'Input Wonen'!$J$13:$N$151,COLUMNS('Input Wonen'!J:K),FALSE),\"\")","v":"Binnenspouwblad, 100mm (bruto)"},{"$f":"IFERROR(VLOOKUP(H49,'Input Wonen'!$J$13:$N$151,COLUMNS('Input Wonen'!J:L),FALSE),\"\")","v":"Prefab beton (UMC)"},null,"GE11.E",{"$f":"IFERROR(VLOOKUP(L49,'Input Wonen'!$P$13:$T$151,COLUMNS('Input Wonen'!P:Q),FALSE),\"\")","v":"Binnenspouwblad, HSB (bruto)"},{"$f":"IFERROR(VLOOKUP(L49,'Input Wonen'!$P$13:$T$151,COLUMNS('Input Wonen'!P:R),FALSE),\"\")","v":"HSB element incl. Isovlas isolatie"}]
[null,null,null,null,"Daken",null,null,null,"Daken",null,null,null,"Daken"]
[null,null,null,"DA01.t",{"$f":"VLOOKUP(D51,'Input Wonen'!$D$13:$H$151,2,FALSE)","v":"Dakconstructie, hellend; Rc=6,3"},{"$f":"VLOOKUP(D51,'Input Wonen'!$D$13:$H$151,3,FALSE)","v":"Prefab houten dakelement"},null,"DA01.HNN",{"$f":"IFERROR(VLOOKUP(H51,'Input Wonen'!$J$13:$N$151,COLUMNS('Input Wonen'!J:K),FALSE),\"\")","v":"Dakconstructie, hellend; Rc=6,3"},{"$f":"IFERROR(VLOOKUP(H51,'Input Wonen'!$J$13:$N$151,COLUMNS('Input Wonen'!J:L),FALSE),\"\")","v":"HSB hellenddakelement incl. vlasisolatie"},null,"DA01.E",{"$f":"IFERROR(VLOOKUP(L51,'Input Wonen'!$P$13:$T$151,COLUMNS('Input Wonen'!P:Q),FALSE),\"\")","v":"Dakconstructie, hellend; Rc=6,3"},{"$f":"IFERROR(VLOOKUP(L51,'Input Wonen'!$P$13:$T$151,COLUMNS('Input Wonen'!P:R),FALSE),\"\")","v":"HSB hellenddakelement incl. vlasisolatie"}]
[null,null,null,"DA06.t",{"$f":"VLOOKUP(D52,'Input Wonen'!$D$13:$H$151,2,FALSE)","v":"Dakafwerking"},{"$f":"VLOOKUP(D52,'Input Wonen'!$D$13:$H$151,3,FALSE)","v":"Betonpan"},null,"DA06.HNN",{"$f":"IFERROR(VLOOKUP(H52,'Input Wonen'!$J$13:$N$151,COLUMNS('Input Wonen'!J:K),FALSE),\"\")","v":"Dakafwerking"},{"$f":"IFERROR(VLOOKUP(H52,'Input Wonen'!$J$13:$N$151,COLUMNS('Input Wonen'!J:L),FALSE),\"\")","v":"Hergebruikte keramische pan"},null,"DA06.E",{"$f":"IFERROR(VLOOKUP(L52,'Input Wonen'!$P$13:$T$151,COLUMNS('Input Wonen'!P:Q),FALSE),\"\")","v":"Dakafwerking"},{"$f":"IFERROR(VLOOKUP(L52,'Input Wonen'!$P$13:$T$151,COLUMNS('Input Wonen'!P:R),FALSE),\"\")","v":"Hergebruikte keramische pan"}]
[null,null,null,"DA10.t",{"$f":"VLOOKUP(D53,'Input Wonen'!$D$13:$H$151,2,FALSE)","v":"Dakraam"},{"$f":"VLOOKUP(D53,'Input Wonen'!$D$13:$H$151,3,FALSE)","v":"Meranti, geschilderd"},null,"DA10.HNN",{"$f":"IFERROR(VLOOKUP(H53,'Input Wonen'!$J$13:$N$151,COLUMNS('Input Wonen'!J:K),FALSE),\"\")","v":"Dakraam"},{"$f":"IFERROR(VLOOKUP(H53,'Input Wonen'!$J$13:$N$151,COLUMNS('Input Wonen'!J:L),FALSE),\"\")","v":"Velux Reclaimed dakraam"},null,"DA10.E",{"$f":"IFERROR(VLOOKUP(L53,'Input Wonen'!$P$13:$T$151,COLUMNS('Input Wonen'!P:Q),FALSE),\"\")","v":"Dakraam"},{"$f":"IFERROR(VLOOKUP(L53,'Input Wonen'!$P$13:$T$151,COLUMNS('Input Wonen'!P:R),FALSE),\"\")","v":"Velux Reclaimed dakraam"}]
[null,null,null,null,"Binnenwanden",null,null,null,"Binnenwanden",null,null,null,"Binnenwanden"]
[null,null,null,"BI02.t",{"$f":"VLOOKUP(D55,'Input Wonen'!$D$13:$H$151,2,FALSE)","v":"Woningscheidende wanden, 100mm;"},{"$f":"VLOOKUP(D55,'Input Wonen'!$D$13:$H$151,3,FALSE)","v":"Prefab beton"},null,"BI02.HNN",{"$f":"IFERROR(VLOOKUP(H55,'Input Wonen'!$J$13:$N$151,COLUMNS('Input Wonen'!J:K),FALSE),\"\")","v":"Woningscheidende wanden, 100mm;"},{"$f":"IFERROR(VLOOKUP(H55,'Input Wonen'!$J$13:$N$151,COLUMNS('Input Wonen'!J:L),FALSE),\"\")","v":"Prefab beton"},null,"BI02.E",{"$f":"IFERROR(VLOOKUP(L55,'Input Wonen'!$P$13:$T$151,COLUMNS('Input Wonen'!P:Q),FALSE),\"\")","v":"Woningscheidende wanden, HSB"},{"$f":"IFERROR(VLOOKUP(L55,'Input Wonen'!$P$13:$T$151,COLUMNS('Input Wonen'!P:R),FALSE),\"\")","v":"HSB binnenwand element met vlasisolatie"}]
[null,null,null,"BI04.t",{"$f":"VLOOKUP(D56,'Input Wonen'!$D$13:$H$151,2,FALSE)","v":"Wandtegelwerk badkamer, toilet en keuken"},{"$f":"VLOOKUP(D56,'Input Wonen'!$D$13:$H$151,3,FALSE)","v":"Keramische tegels; geglazuurd/gelijmd"},null,"BI04.HNN",{"$f":"IFERROR(VLOOKUP(H56,'Input Wonen'!$J$13:$N$151,COLUMNS('Input Wonen'!J:K),FALSE),\"\")","v":"Wandtegelwerk badkamer, toilet en keuken"},{"$f":"IFERROR(VLOOKUP(H56,'Input Wonen'!$J$13:$N$151,COLUMNS('Input Wonen'!J:L),FALSE),\"\")","v":"Mosa C2C wandtegels"},null,"BI04.E",{"$f":"IFERROR(VLOOKUP(L56,'Input Wonen'!$P$13:$T$151,COLUMNS('Input Wonen'!P:Q),FALSE),\"\")","v":"Wandtegelwerk badkamer, toilet en keuken"},{"$f":"IFERROR(VLOOKUP(L56,'Input Wonen'!$P$13:$T$151,COLUMNS('Input Wonen'!P:R),FALSE),\"\")","v":"Gerecycled PET i.c.m. Quartz"}]
[null,null,null,"BI14.t",{"$f":"VLOOKUP(D57,'Input Wonen'!$D$13:$H$151,2,FALSE)","v":"Systeemwanden; gipskartonplaat, 100mm"},{"$f":"VLOOKUP(D57,'Input Wonen'!$D$13:$H$151,3,FALSE)","v":"Enkel beplaat, 60 mm glaswol"},null,"BI14.HNN",{"$f":"IFERROR(VLOOKUP(H57,'Input Wonen'!$J$13:$N$151,COLUMNS('Input Wonen'!J:K),FALSE),\"\")","v":"Binnenwanden, 35mm"},{"$f":"IFERROR(VLOOKUP(H57,'Input Wonen'!$J$13:$N$151,COLUMNS('Input Wonen'!J:L),FALSE),\"\")","v":"Faay volpaneel"},null,"BI14.E",{"$f":"IFERROR(VLOOKUP(L57,'Input Wonen'!$P$13:$T$151,COLUMNS('Input Wonen'!P:Q),FALSE),\"\")","v":"Binnenwanden, 54mm"},{"$f":"IFERROR(VLOOKUP(L57,'Input Wonen'!$P$13:$T$151,COLUMNS('Input Wonen'!P:R),FALSE),\"\")","v":"Faay volpaneel; enkel beplaat"}]
[null,null,null,"BI05.t",{"$f":"VLOOKUP(D58,'Input Wonen'!$D$13:$H$151,2,FALSE)","v":"Binnenwanden, 70mm"},{"$f":"VLOOKUP(D58,'Input Wonen'!$D$13:$H$151,3,FALSE)","v":"Gipsblokken, normale dichtheid"},null,"BI05.HNN",{"$f":"IFERROR(VLOOKUP(H58,'Input Wonen'!$J$13:$N$151,COLUMNS('Input Wonen'!J:K),FALSE),\"\")","v":"Binnenwanden, 70mm"},{"$f":"IFERROR(VLOOKUP(H58,'Input Wonen'!$J$13:$N$151,COLUMNS('Input Wonen'!J:L),FALSE),\"\")","v":"Faay volpaneel"},null,"BI05.E",{"$f":"IFERROR(VLOOKUP(L58,'Input Wonen'!$P$13:$T$151,COLUMNS('Input Wonen'!P:Q),FALSE),\"\")","v":"Binnenwanden, 70mm"},{"$f":"IFERROR(VLOOKUP(L58,'Input Wonen'!$P$13:$T$151,COLUMNS('Input Wonen'!P:R),FALSE),\"\")","v":"Faay volpaneel"}]
[null,null,null,"BI06.t",{"$f":"VLOOKUP(D59,'Input Wonen'!$D$13:$H$151,2,FALSE)","v":"Binnenwanden, 70mm"},{"$f":"VLOOKUP(D59,'Input Wonen'!$D$13:$H$151,3,FALSE)","v":"Gipsblokken, hoge dichtheid"},null,"BI06.HNN",{"$f":"IFERROR(VLOOKUP(H59,'Input Wonen'!$J$13:$N$151,COLUMNS('Input Wonen'!J:K),FALSE),\"\")","v":"Binnenwanden, 70mm"},{"$f":"IFERROR(VLOOKUP(H59,'Input Wonen'!$J$13:$N$151,COLUMNS('Input Wonen'!J:L),FALSE),\"\")","v":"Faay volpaneel"},null,"BI06.E",{"$f":"IFERROR(VLOOKUP(L59,'Input Wonen'!$P$13:$T$151,COLUMNS('Input Wonen'!P:Q),FALSE),\"\")","v":"Binnenwanden, 70mm"},{"$f":"IFERROR(VLOOKUP(L59,'Input Wonen'!$P$13:$T$151,COLUMNS('Input Wonen'!P:R),FALSE),\"\")","v":"Faay volpaneel"}]
[null,null,null,"BI11.t",{"$f":"VLOOKUP(D60,'Input Wonen'!$D$13:$H$151,2,FALSE)","v":"Binnenkozijnen"},{"$f":"VLOOKUP(D60,'Input Wonen'!$D$13:$H$151,3,FALSE)","v":"Staal; verzinkt+gemoffeld"},null,"BI11.HNN",{"$f":"IFERROR(VLOOKUP(H60,'Input Wonen'!$J$13:$N$151,COLUMNS('Input Wonen'!J:K),FALSE),\"\")","v":"Binnenkozijnen"},{"$f":"IFERROR(VLOOKUP(H60,'Input Wonen'!$J$13:$N$151,COLUMNS('Input Wonen'!J:L),FALSE),\"\")","v":"Europees naaldhout, geschilderd"},null,"BI11.E",{"$f":"IFERROR(VLOOKUP(L60,'Input Wonen'!$P$13:$T$151,COLUMNS('Input Wonen'!P:Q),FALSE),\"\")","v":"Binnenkozijnen"},{"$f":"IFERROR(VLOOKUP(L60,'Input Wonen'!$P$13:$T$151,COLUMNS('Input Wonen'!P:R),FALSE),\"\")","v":"Europees naaldhout, geschilderd"}]
[null,null,null,"BI08.t",{"$f":"VLOOKUP(D61,'Input Wonen'!$D$13:$H$151,2,FALSE)","v":"Binnendeuren"},{"$f":"VLOOKUP(D61,'Input Wonen'!$D$13:$H$151,3,FALSE)","v":"Honingraat; vlakke binnendeur"},null,"BI08.HNN",{"$f":"IFERROR(VLOOKUP(H61,'Input Wonen'!$J$13:$N$151,COLUMNS('Input Wonen'!J:K),FALSE),\"\")","v":"Binnendeuren"},{"$f":"IFERROR(VLOOKUP(H61,'Input Wonen'!$J$13:$N$151,COLUMNS('Input Wonen'!J:L),FALSE),\"\")","v":"Honingraat; vlakke binnendeur"},null,"BI08.E",{"$f":"IFERROR(VLOOKUP(L61,'Input Wonen'!$P$13:$T$151,COLUMNS('Input Wonen'!P:Q),FALSE),\"\")","v":"Binnendeuren"},{"$f":"IFERROR(VLOOKUP(L61,'Input Wonen'!$P$13:$T$151,COLUMNS('Input Wonen'!P:R),FALSE),\"\")","v":"Honingraat; vlakke binnendeur"}]
[null,null,null,"BI10.t",{"$f":"VLOOKUP(D62,'Input Wonen'!$D$13:$H$151,2,FALSE)","v":"Binnendorpels"},{"$f":"VLOOKUP(D62,'Input Wonen'!$D$13:$H$151,3,FALSE)","v":"Gegoten composietsteen"},null,"BI10.HNN",{"$f":"IFERROR(VLOOKUP(H62,'Input Wonen'!$J$13:$N$151,COLUMNS('Input Wonen'!J:K),FALSE),\"\")","v":"Binnendorpels"},{"$f":"IFERROR(VLOOKUP(H62,'Input Wonen'!$J$13:$N$151,COLUMNS('Input Wonen'!J:L),FALSE),\"\")","v":"Kunststeen"},null,"BI10.E",{"$f":"IFERROR(VLOOKUP(L62,'Input Wonen'!$P$13:$T$151,COLUMNS('Input Wonen'!P:Q),FALSE),\"\")","v":"Binnendorpels"},{"$f":"IFERROR(VLOOKUP(L62,'Input Wonen'!$P$13:$T$151,COLUMNS('Input Wonen'!P:R),FALSE),\"\")","v":"Kunststeen"}]
[null,null,null,null,"Klimaatinstallaties",null,null,null,"Klimaatinstallaties",null,null,null,"Klimaatinstallaties"]
[null,null,null,"KL02.t",{"$f":"VLOOKUP(D64,'Input Wonen'!$D$13:$H$151,2,FALSE)","v":"Warmtedistributiesysteem"},{"$f":"VLOOKUP(D64,'Input Wonen'!$D$13:$H$151,3,FALSE)","v":"CV-leidingen incl. koppelingen + verdeling"},null,"KL02.HNN",{"$f":"IFERROR(VLOOKUP(H64,'Input Wonen'!$J$13:$N$151,COLUMNS('Input Wonen'!J:K),FALSE),\"\")","v":"Warmtedistributiesysteem"},{"$f":"IFERROR(VLOOKUP(H64,'Input Wonen'!$J$13:$N$151,COLUMNS('Input Wonen'!J:L),FALSE),\"\")","v":"CV-leidingen incl. koppelingen + verdeling"},null,"KL02.E",{"$f":"IFERROR(VLOOKUP(L64,'Input Wonen'!$P$13:$T$151,COLUMNS('Input Wonen'!P:Q),FALSE),\"\")","v":"Warmtedistributiesysteem"},{"$f":"IFERROR(VLOOKUP(L64,'Input Wonen'!$P$13:$T$151,COLUMNS('Input Wonen'!P:R),FALSE),\"\")","v":"CV-leidingen incl. koppelingen + verdeling"}]
[null,null,null,"KL03.t",{"$f":"VLOOKUP(D65,'Input Wonen'!$D$13:$H$151,2,FALSE)","v":"Warmteafgiftesysteem"},{"$f":"VLOOKUP(D65,'Input Wonen'!$D$13:$H$151,3,FALSE)","v":"Vloerverwarming 95 W/m2"},null,"KL03.HNN",{"$f":"IFERROR(VLOOKUP(H65,'Input Wonen'!$J$13:$N$151,COLUMNS('Input Wonen'!J:K),FALSE),\"\")","v":"Warmteafgiftesysteem"},{"$f":"IFERROR(VLOOKUP(H65,'Input Wonen'!$J$13:$N$151,COLUMNS('Input Wonen'!J:L),FALSE),\"\")","v":"Vloerverwarming 95 W/m2"},null,"KL03.E",{"$f":"IFERROR(VLOOKUP(L65,'Input Wonen'!$P$13:$T$151,COLUMNS('Input Wonen'!P:Q),FALSE),\"\")","v":"Warmteafgiftesysteem"},{"$f":"IFERROR(VLOOKUP(L65,'Input Wonen'!$P$13:$T$151,COLUMNS('Input Wonen'!P:R),FALSE),\"\")","v":"Vloerverwarming 95 W/m2 "}]
[null,null,null,"KL01.t",{"$f":"VLOOKUP(D66,'Input Wonen'!$D$13:$H$151,2,FALSE)","v":"Warmteopwekkinginstallatie"},{"$f":"VLOOKUP(D66,'Input Wonen'!$D$13:$H$151,3,FALSE)","v":"Warmtepomp luchtwater 10kW "},null,"KL01.HNN",{"$f":"IFERROR(VLOOKUP(H66,'Input Wonen'!$J$13:$N$151,COLUMNS('Input Wonen'!J:K),FALSE),\"\")","v":"Warmteopwekkinginstallatie"},{"$f":"IFERROR(VLOOKUP(H66,'Input Wonen'!$J$13:$N$151,COLUMNS('Input Wonen'!J:L),FALSE),\"\")","v":"Warmtepomp luchtwater 10kW "},null,"KL01.E",{"$f":"IFERROR(VLOOKUP(L66,'Input Wonen'!$P$13:$T$151,COLUMNS('Input Wonen'!P:Q),FALSE),\"\")","v":"Warmteopwekkinginstallatie"},{"$f":"IFERROR(VLOOKUP(L66,'Input Wonen'!$P$13:$T$151,COLUMNS('Input Wonen'!P:R),FALSE),\"\")","v":"Warmtepomp luchtwater 10kW "}]
[null,null,null,"KL04.t",{"$f":"VLOOKUP(D67,'Input Wonen'!$D$13:$H$151,2,FALSE)","v":"Luchtdistributiesysteem"},{"$f":"VLOOKUP(D67,'Input Wonen'!$D$13:$H$151,3,FALSE)","v":"VLA ventilatiesysteem, type C; W-bouw, individueel"},null,"KL04.HNN",{"$f":"IFERROR(VLOOKUP(H67,'Input Wonen'!$J$13:$N$151,COLUMNS('Input Wonen'!J:K),FALSE),\"\")","v":"Luchtdistributiesysteem"},{"$f":"IFERROR(VLOOKUP(H67,'Input Wonen'!$J$13:$N$151,COLUMNS('Input Wonen'!J:L),FALSE),\"\")","v":"VLA ventilatiesysteem, type C; W-bouw, individueel"},null,"KL04.E",{"$f":"IFERROR(VLOOKUP(L67,'Input Wonen'!$P$13:$T$151,COLUMNS('Input Wonen'!P:Q),FALSE),\"\")","v":"Luchtdistributiesysteem"},{"$f":"IFERROR(VLOOKUP(L67,'Input Wonen'!$P$13:$T$151,COLUMNS('Input Wonen'!P:R),FALSE),\"\")","v":"VLA ventilatiesysteem, type C; W-bouw, individueel"}]
[null,null,null,"KL07.t",{"$f":"VLOOKUP(D68,'Input Wonen'!$D$13:$H$151,2,FALSE)","v":"Warmtapwaterinstallatie"},{"$f":"VLOOKUP(D68,'Input Wonen'!$D$13:$H$151,3,FALSE)","v":"Elektrische boiler; CW:4-6 120 liter"},null,"KL07.HNN",{"$f":"IFERROR(VLOOKUP(H68,'Input Wonen'!$J$13:$N$151,COLUMNS('Input Wonen'!J:K),FALSE),\"\")","v":"Warmtapwaterinstallatie"},{"$f":"IFERROR(VLOOKUP(H68,'Input Wonen'!$J$13:$N$151,COLUMNS('Input Wonen'!J:L),FALSE),\"\")","v":"Elektrische boiler; CW:4-6 120 liter"},null,"KL07.E",{"$f":"IFERROR(VLOOKUP(L68,'Input Wonen'!$P$13:$T$151,COLUMNS('Input Wonen'!P:Q),FALSE),\"\")","v":"Warmtapwaterinstallatie"},{"$f":"IFERROR(VLOOKUP(L68,'Input Wonen'!$P$13:$T$151,COLUMNS('Input Wonen'!P:R),FALSE),\"\")","v":"Elektrische boiler; CW:4-6 120 liter"}]
[null,null,null,null,"Elektrische installaties",null,null,null,"Elektrische installaties",null,null,null,"Elektrische installaties"]
[null,null,null,"EL02.t",{"$f":"VLOOKUP(D70,'Input Wonen'!$D$13:$H$151,2,FALSE)","v":"Pv-panelen, hellend dak"},{"$f":"VLOOKUP(D70,'Input Wonen'!$D$13:$H$151,3,FALSE)","v":"Mono-Si; incl. inverter+kabels"},null,"EL02.HNN",{"$f":"IFERROR(VLOOKUP(H70,'Input Wonen'!$J$13:$N$151,COLUMNS('Input Wonen'!J:K),FALSE),\"\")","v":"Pv-panelen, hellend dak"},{"$f":"IFERROR(VLOOKUP(H70,'Input Wonen'!$J$13:$N$151,COLUMNS('Input Wonen'!J:L),FALSE),\"\")","v":"Exasun Xglass"},null,"EL02.E",{"$f":"IFERROR(VLOOKUP(L70,'Input Wonen'!$P$13:$T$151,COLUMNS('Input Wonen'!P:Q),FALSE),\"\")","v":"Pv-panelen, hellend dak"},{"$f":"IFERROR(VLOOKUP(L70,'Input Wonen'!$P$13:$T$151,COLUMNS('Input Wonen'!P:R),FALSE),\"\")","v":"Exasun Xroof (deels tvv van dakpannen)"}]
[null,null,null,"EL01.t",{"$f":"VLOOKUP(D71,'Input Wonen'!$D$13:$H$151,2,FALSE)","v":"Elektriciteitsleidingen"},{"$f":"VLOOKUP(D71,'Input Wonen'!$D$13:$H$151,3,FALSE)","v":"Geïsoleerde installatiedraad + mantelbuis"},null,"EL01.HNN",{"$f":"VLOOKUP(H71,'Input Wonen'!$J$13:$N$151,2,FALSE)","v":"Elektriciteitsleidingen"},{"$f":"VLOOKUP(H71,'Input Wonen'!$J$13:$N$151,3,FALSE)","v":"Geïsoleerde installatiedraad + mantelbuis"},null,"EL01.E",{"$f":"IFERROR(VLOOKUP(L71,'Input Wonen'!$P$13:$T$151,COLUMNS('Input Wonen'!P:Q),FALSE),\"\")","v":"Elektriciteitsleidingen"},{"$f":"IFERROR(VLOOKUP(L71,'Input Wonen'!$P$13:$T$151,COLUMNS('Input Wonen'!P:R),FALSE),\"\")","v":"Geïsoleerde installatiedraad + mantelbuis"}]
[null,null,null,null,"Toe- en afvoeren",null,null,null,"Toe- en afvoeren",null,null,null,"Toe- en afvoeren"]
[null,null,null,"TO01.t",{"$f":"VLOOKUP(D73,'Input Wonen'!$D$13:$H$151,2,FALSE)","v":"Waterleidingen"},{"$f":"VLOOKUP(D73,'Input Wonen'!$D$13:$H$151,3,FALSE)","v":"Polyetheen; leiding+mantelbuis"},null,"TO01.HNN",{"$f":"IFERROR(VLOOKUP(H73,'Input Wonen'!$J$13:$N$151,COLUMNS('Input Wonen'!J:K),FALSE),\"\")","v":"Waterleidingen"},{"$f":"IFERROR(VLOOKUP(H73,'Input Wonen'!$J$13:$N$151,COLUMNS('Input Wonen'!J:L),FALSE),\"\")","v":"Polyetheen"},null,"TO01.E",{"$f":"IFERROR(VLOOKUP(L73,'Input Wonen'!$P$13:$T$151,COLUMNS('Input Wonen'!P:Q),FALSE),\"\")","v":"Waterleidingen"},{"$f":"IFERROR(VLOOKUP(L73,'Input Wonen'!$P$13:$T$151,COLUMNS('Input Wonen'!P:R),FALSE),\"\")","v":"Polyetheen"}]
[null,null,null,"TO02.t",{"$f":"VLOOKUP(D74,'Input Wonen'!$D$13:$H$151,2,FALSE)","v":"Buitenriolering kavel"},{"$f":"VLOOKUP(D74,'Input Wonen'!$D$13:$H$151,3,FALSE)","v":"PVC"},null,"TO02.HNN",{"$f":"VLOOKUP(H74,'Input Wonen'!$J$13:$N$151,2,FALSE)","v":"Buitenriolering"},{"$f":"VLOOKUP(H74,'Input Wonen'!$J$13:$N$151,3,FALSE)","v":"Gerecycled PVC (Pipelife)"},null,"TO02.E",{"$f":"IFERROR(VLOOKUP(L74,'Input Wonen'!$P$13:$T$151,COLUMNS('Input Wonen'!P:Q),FALSE),\"\")","v":"Buitenriolering"},{"$f":"IFERROR(VLOOKUP(L74,'Input Wonen'!$P$13:$T$151,COLUMNS('Input Wonen'!P:R),FALSE),\"\")","v":"Gerecycled PVC (Pipelife)"}]
[null,null,null,"TO03.t",{"$f":"VLOOKUP(D75,'Input Wonen'!$D$13:$H$151,2,FALSE)","v":"Binnenriolering"},{"$f":"VLOOKUP(D75,'Input Wonen'!$D$13:$H$151,3,FALSE)","v":"PVC"},null,"TO03.HNN",{"$f":"VLOOKUP(H75,'Input Wonen'!$J$13:$N$151,2,FALSE)","v":"Binnenriolering"},{"$f":"VLOOKUP(H75,'Input Wonen'!$J$13:$N$151,3,FALSE)","v":"Gerecycled PVC (Pipelife)"},null,"TO03.E",{"$f":"IFERROR(VLOOKUP(L75,'Input Wonen'!$P$13:$T$151,COLUMNS('Input Wonen'!P:Q),FALSE),\"\")","v":"Binnenriolering"},{"$f":"IFERROR(VLOOKUP(L75,'Input Wonen'!$P$13:$T$151,COLUMNS('Input Wonen'!P:R),FALSE),\"\")","v":"Gerecycled PVC (Pipelife)"}]
[null,null,null,"TO04.t",{"$f":"VLOOKUP(D76,'Input Wonen'!$D$13:$H$151,2,FALSE)","v":"Hemelwaterafvoer"},{"$f":"VLOOKUP(D76,'Input Wonen'!$D$13:$H$151,3,FALSE)","v":"PVC"},null,"TO04.HNN",{"$f":"VLOOKUP(H76,'Input Wonen'!$J$13:$N$151,2,FALSE)","v":"Hemelwaterafvoer"},{"$f":"VLOOKUP(H76,'Input Wonen'!$J$13:$N$151,3,FALSE)","v":"Gerecycled PVC (Pipelife)"},null,"TO04.E",{"$f":"IFERROR(VLOOKUP(L76,'Input Wonen'!$P$13:$T$151,COLUMNS('Input Wonen'!P:Q),FALSE),\"\")","v":"Hemelwaterafvoer"},{"$f":"IFERROR(VLOOKUP(L76,'Input Wonen'!$P$13:$T$151,COLUMNS('Input Wonen'!P:R),FALSE),\"\")","v":"Gerecycled PVC (Pipelife)"}]
[null,null,null,"TO05.t",{"$f":"VLOOKUP(D77,'Input Wonen'!$D$13:$H$151,2,FALSE)","v":"Dakgoot"},{"$f":"VLOOKUP(D77,'Input Wonen'!$D$13:$H$151,3,FALSE)","v":"Aluminium"},null,"TO05.HNN",{"$f":"VLOOKUP(H77,'Input Wonen'!$J$13:$N$151,2,FALSE)","v":"Dakgoot"},{"$f":"VLOOKUP(H77,'Input Wonen'!$J$13:$N$151,3,FALSE)","v":"Aluminium"},null,"TO05.E",{"$f":"IFERROR(VLOOKUP(L77,'Input Wonen'!$P$13:$T$151,COLUMNS('Input Wonen'!P:Q),FALSE),\"\")","v":"Dakgoot"},{"$f":"IFERROR(VLOOKUP(L77,'Input Wonen'!$P$13:$T$151,COLUMNS('Input Wonen'!P:R),FALSE),\"\")","v":"Aluminium"}]
[null,null,null,null,"Verkeersruimte",null,null,null,"Verkeersruimte",null,null,null,"Verkeersruimte"]
[null,null,null,"VE01.t",{"$f":"VLOOKUP(D79,'Input Wonen'!$D$13:$H$151,2,FALSE)","v":"Interne trap"},{"$f":"VLOOKUP(D79,'Input Wonen'!$D$13:$H$151,3,FALSE)","v":"Eur. loofhout; geschilderd"},null,"VE01.HNN",{"$f":"IFERROR(VLOOKUP(H79,'Input Wonen'!$J$13:$N$151,COLUMNS('Input Wonen'!J:K),FALSE),\"\")","v":"Interne trap"},{"$f":"IFERROR(VLOOKUP(H79,'Input Wonen'!$J$13:$N$151,COLUMNS('Input Wonen'!J:L),FALSE),\"\")","v":"Eur. loofhout; geschilderd"},null,"VE01.E",{"$f":"IFERROR(VLOOKUP(L79,'Input Wonen'!$P$13:$T$151,COLUMNS('Input Wonen'!P:Q),FALSE),\"\")","v":"Interne trap"},{"$f":"IFERROR(VLOOKUP(L79,'Input Wonen'!$P$13:$T$151,COLUMNS('Input Wonen'!P:R),FALSE),\"\")","v":"Eur. loofhout; geschilderd"}]
[null,null,null,"VE05.t",{"$f":"VLOOKUP(D80,'Input Wonen'!$D$13:$H$151,2,FALSE)","v":"Leuningen"},{"$f":"VLOOKUP(D80,'Input Wonen'!$D$13:$H$151,3,FALSE)","v":"Eur. loofhout; duurzame bosbouw"},null,"VE05.HNN",{"$f":"VLOOKUP(H80,'Input Wonen'!$J$13:$N$151,2,FALSE)","v":"Leuningen"},{"$f":"VLOOKUP(H80,'Input Wonen'!$J$13:$N$151,3,FALSE)","v":"Eur. loofhout; duurzame bosbouw"},null,"VE05.E",{"$f":"IFERROR(VLOOKUP(L80,'Input Wonen'!$P$13:$T$151,COLUMNS('Input Wonen'!P:Q),FALSE),\"\")","v":"Leuningen"},{"$f":"IFERROR(VLOOKUP(L80,'Input Wonen'!$P$13:$T$151,COLUMNS('Input Wonen'!P:R),FALSE),\"\")","v":"Eur. loofhout; duurzame bosbouw"}]
[null,null,null,"VE03.t",{"$f":"VLOOKUP(D81,'Input Wonen'!$D$13:$H$151,2,FALSE)","v":"Balustrades"},{"$f":"VLOOKUP(D81,'Input Wonen'!$D$13:$H$151,3,FALSE)","v":"Eur. loofhout; spijlen; duurzame bosbouw"},null,"VE03.HNN",{"$f":"VLOOKUP(H81,'Input Wonen'!$J$13:$N$151,2,FALSE)","v":"Balustrades"},{"$f":"VLOOKUP(H81,'Input Wonen'!$J$13:$N$151,3,FALSE)","v":"Eur. loofhout; spijlen; duurzame bosbouw"},null,"VE03.E",{"$f":"IFERROR(VLOOKUP(L81,'Input Wonen'!$P$13:$T$151,COLUMNS('Input Wonen'!P:Q),FALSE),\"\")","v":"Balustrades"},{"$f":"IFERROR(VLOOKUP(L81,'Input Wonen'!$P$13:$T$151,COLUMNS('Input Wonen'!P:R),FALSE),\"\")","v":"Eur. loofhout; spijlen; duurzame bosbouw"}]
[null,null,null,null,"Vaste voorzieningen",null,null,null,"Vaste voorzieningen",null,null,null,"Vaste voorzieningen"]
[null,null,null,"VA01.t",{"$f":"VLOOKUP(D83,'Input Wonen'!$D$13:$H$151,2,FALSE)","v":"Toiletten; wandcloset + fontein"},{"$f":"VLOOKUP(D83,'Input Wonen'!$D$13:$H$151,3,FALSE)","v":"Porselein"},null,"VA01.HNN",{"$f":"IFERROR(VLOOKUP(H83,'Input Wonen'!$J$13:$N$151,COLUMNS('Input Wonen'!J:K),FALSE),\"\")","v":"Toiletten; wandcloset + fontein"},{"$f":"IFERROR(VLOOKUP(H83,'Input Wonen'!$J$13:$N$151,COLUMNS('Input Wonen'!J:L),FALSE),\"\")","v":"Porselein"},null,"VA01.E",{"$f":"IFERROR(VLOOKUP(L83,'Input Wonen'!$P$13:$T$151,COLUMNS('Input Wonen'!P:Q),FALSE),\"\")","v":"Toiletten; wandcloset + fontein"},{"$f":"IFERROR(VLOOKUP(L83,'Input Wonen'!$P$13:$T$151,COLUMNS('Input Wonen'!P:R),FALSE),\"\")","v":"Porselein"}]
[null,null,null,"VA02.t",{"$f":"VLOOKUP(D84,'Input Wonen'!$D$13:$H$151,2,FALSE)","v":"Wastafel"},{"$f":"VLOOKUP(D84,'Input Wonen'!$D$13:$H$151,3,FALSE)","v":"Keramisch"},null,"VA02.HNN",{"$f":"VLOOKUP(H84,'Input Wonen'!$J$13:$N$151,2,FALSE)","v":"Wastafel"},{"$f":"VLOOKUP(H84,'Input Wonen'!$J$13:$N$151,3,FALSE)","v":"Keramisch"},null,"VA02.E",{"$f":"IFERROR(VLOOKUP(L84,'Input Wonen'!$P$13:$T$151,COLUMNS('Input Wonen'!P:Q),FALSE),\"\")","v":"Wastafel"},{"$f":"IFERROR(VLOOKUP(L84,'Input Wonen'!$P$13:$T$151,COLUMNS('Input Wonen'!P:R),FALSE),\"\")","v":"Keramisch"}]
[null,null,null,"VA03.t",{"$f":"VLOOKUP(D85,'Input Wonen'!$D$13:$H$151,2,FALSE)","v":"Inloopdouche"},{"$f":"VLOOKUP(D85,'Input Wonen'!$D$13:$H$151,3,FALSE)","v":"Gipsblokken + tegels incl. rvs afvoergoot"},null,"VA03.HNN",{"$f":"VLOOKUP(H85,'Input Wonen'!$J$13:$N$151,2,FALSE)","v":"Inloopdouche"},{"$f":"VLOOKUP(H85,'Input Wonen'!$J$13:$N$151,3,FALSE)","v":"Gipsblokken + tegels incl. rvs afvoergoot"},null,"VA03.E",{"$f":"IFERROR(VLOOKUP(L85,'Input Wonen'!$P$13:$T$151,COLUMNS('Input Wonen'!P:Q),FALSE),\"\")","v":"Inloopdouche"},{"$f":"IFERROR(VLOOKUP(L85,'Input Wonen'!$P$13:$T$151,COLUMNS('Input Wonen'!P:R),FALSE),\"\")","v":"Gipsblokken + tegels incl. rvs afvoergoot"}]
[null,null,null,null,"Overige kosten",null,null,null,"Overige kosten",null,null,null,"Overige kosten"]
[null,null,null,"OK01.t",{"$f":"VLOOKUP(D87,'Input Wonen'!$D$13:$H$165,2,FALSE)","v":"Grondwerk, maatvoering, invoeren en sparingen"},null,null,"OK01.HNN",{"$f":"VLOOKUP(D87,'Input Wonen'!$D$13:$H$165,2,FALSE)","v":"Grondwerk, maatvoering, invoeren en sparingen"},null,null,"OK01.E",{"$f":"VLOOKUP(D87,'Input Wonen'!$D$13:$H$165,2,FALSE)","v":"Grondwerk, maatvoering, invoeren en sparingen"}]
[null,null,null,"OK02.t",{"$f":"VLOOKUP(D88,'Input Wonen'!$D$13:$H$165,2,FALSE)","v":"Gevelsteiger"},{"$f":"VLOOKUP(D88,'Input Wonen'!$D$13:$H$165,3,FALSE)","v":0},null,"OK02.HNN",{"$f":"VLOOKUP(H88,'Input Wonen'!$J$13:$N$165,2,FALSE)","v":"Gevelsteiger"},null,null,"OK02.E",{"$f":"VLOOKUP(D88,'Input Wonen'!$D$13:$H$165,2,FALSE)","v":"Gevelsteiger"}]
[null,null,null,"OK04.t",{"$f":"VLOOKUP(D89,'Input Wonen'!$D$13:$H$165,2,FALSE)","v":"Afbouwwerkzaamheden (klein timmerwerk, schilderwerk)"},{"$f":"VLOOKUP(D89,'Input Wonen'!$D$13:$H$165,3,FALSE)","v":0},null,"OK04.HNN",{"$f":"VLOOKUP(H89,'Input Wonen'!$J$13:$N$165,2,FALSE)","v":"Afbouwwerkzaamheden (klein timmerwerk, schilderwerk)"},null,null,"OK04.E",{"$f":"VLOOKUP(D89,'Input Wonen'!$D$13:$H$165,2,FALSE)","v":"Afbouwwerkzaamheden (klein timmerwerk, schilderwerk)"}]
[null,null,null,"OK07b.t",{"$f":"VLOOKUP(D90,'Input Wonen'!$D$13:$H$165,2,FALSE)","v":"Installaties (E, W & klimaat) grondgebonden woning tussen"},{"$f":"VLOOKUP(D90,'Input Wonen'!$D$13:$H$165,3,FALSE)","v":0},null,"OK07b.HNN",{"$f":"VLOOKUP(H90,'Input Wonen'!$J$13:$N$165,2,FALSE)","v":"Installaties (E, W & klimaat) grondgebonden woning tussen"},null,null,"OK07b.E",{"$f":"VLOOKUP(D90,'Input Wonen'!$D$13:$H$165,2,FALSE)","v":"Installaties (E, W & klimaat) grondgebonden woning tussen"}]
[]
[null,null,null,null,"Traditioneel",null,null,null,"Het Nieuwe Normaal",null,null,null,"Het Nieuwe Normaal ambitieus"]
[]
[null,null,null,null,"WONEN",null,null,null,"WONEN",null,null,null,"WONEN"]
[]
[]
[]
[]
[]
[]
[null,null,null,null,null,null,null,{"$f":"0.696-I101","v":0.61049999999999993},{"$f":"0.095-0.0095","v":8.5500000000000007E-2}]
[]
[]
[]
[]
[]
[]
[null,null,null,null,"Woning M hoek",null,null,null,"Woning M hoek",null,null,null,"Woning M hoek"]
[null,null,null,null,"Element","Materialisatie",null,null,"Element","Materialisatie",null,null,"Element","Materialisatie"]
[]
[null,null,null,null,"Fundering",null,null,null,"Fundering",null,null,null,"Fundering"]
[null,null,null,"FU03.t",{"$f":"VLOOKUP(D112,'Input Wonen'!$D$13:$H$151,2,FALSE)","v":"Funderingspaal, ⌀ 300mm; l=15,0m"},{"$f":"VLOOKUP(D112,'Input Wonen'!$D$13:$H$151,3,FALSE)","v":"Schroefpaal; beton, in het werk gestort, C20/25,CEMIII; incl.wapening"},null,"FU03.HNN",{"$f":"IFERROR(VLOOKUP(H112,'Input Wonen'!$J$13:$N$151,COLUMNS('Input Wonen'!J:K),FALSE),\"\")","v":"Funderingspaal, ⌀ 300mm; l=15,0m"},{"$f":"IFERROR(VLOOKUP(H112,'Input Wonen'!$J$13:$N$151,COLUMNS('Input Wonen'!J:L),FALSE),\"\")","v":"Beton met 56% aan secundair aandeel (UMC)"},null,"FU03.E",{"$f":"IFERROR(VLOOKUP(L112,'Input Wonen'!$P$13:$T$151,COLUMNS('Input Wonen'!P:Q),FALSE),\"\")","v":"Funderingspaal, ⌀ 300mm; l=15,0m"},{"$f":"IFERROR(VLOOKUP(L112,'Input Wonen'!$P$13:$T$151,COLUMNS('Input Wonen'!P:R),FALSE),\"\")","v":"Beton met 56% aan secundair aandeel (UMC)"}]
[null,null,null,"FU02.t",{"$f":"VLOOKUP(D113,'Input Wonen'!$D$13:$H$151,2,FALSE)","v":"Funderingsbalken, 400x500mm"},{"$f":"VLOOKUP(D113,'Input Wonen'!$D$13:$H$151,3,FALSE)","v":"In het werk gestort"},null,"FU02.HNN",{"$f":"IFERROR(VLOOKUP(H113,'Input Wonen'!$J$13:$N$151,COLUMNS('Input Wonen'!J:K),FALSE),\"\")","v":"Funderingsbalken, 400x500mm"},{"$f":"IFERROR(VLOOKUP(H113,'Input Wonen'!$J$13:$N$151,COLUMNS('Input Wonen'!J:L),FALSE),\"\")","v":"Beton met 56% aan secundair aandeel (UMC)"},null,"FU02.E",{"$f":"IFERROR(VLOOKUP(L113,'Input Wonen'!$P$13:$T$151,COLUMNS('Input Wonen'!P:Q),FALSE),\"\")","v":"Funderingsbalken, 400x500mm"},{"$f":"IFERROR(VLOOKUP(L113,'Input Wonen'!$P$13:$T$151,COLUMNS('Input Wonen'!P:R),FALSE),\"\")","v":"Beton met 56% aan secundair aandeel (UMC)"}]
[null,null,null,"FU05.t",{"$f":"VLOOKUP(D114,'Input Wonen'!$D$13:$H$151,2,FALSE)","v":"Bodemafsluiting, zand"},{"$f":"VLOOKUP(D114,'Input Wonen'!$D$13:$H$151,3,FALSE)","v":"Zand"},null,"FU05.HNN",{"$f":"IFERROR(VLOOKUP(H114,'Input Wonen'!$J$13:$N$151,COLUMNS('Input Wonen'!J:K),FALSE),\"\")","v":"Bodemafsluiting, 100 zand"},{"$f":"IFERROR(VLOOKUP(H114,'Input Wonen'!$J$13:$N$151,COLUMNS('Input Wonen'!J:L),FALSE),\"\")","v":"Zand"},null,"FU05.E",{"$f":"IFERROR(VLOOKUP(L114,'Input Wonen'!$P$13:$T$151,COLUMNS('Input Wonen'!P:Q),FALSE),\"\")","v":"Bodemafsluiting, 100 zand"},{"$f":"IFERROR(VLOOKUP(L114,'Input Wonen'!$P$13:$T$151,COLUMNS('Input Wonen'!P:R),FALSE),\"\")","v":"Zand"}]
[null,null,null,null,"Vloeren",null,null,null,"Vloeren",null,null,null,"Vloeren"]
[null,null,null,"VL01.t",{"$f":"VLOOKUP(D116,'Input Wonen'!$D$13:$H$151,2,FALSE)","v":"BG: ribbenvloer, vrijdragend incl. isolatie (Rc=3,7)"},{"$f":"VLOOKUP(D116,'Input Wonen'!$D$13:$H$151,3,FALSE)","v":"Prefab beton"},null,"VL01.HNN",{"$f":"IFERROR(VLOOKUP(H116,'Input Wonen'!$J$13:$N$151,COLUMNS('Input Wonen'!J:K),FALSE),\"\")","v":"BG: kanaalplaatvloer, 200mm incl. isolatie (Rc=3,7)"},{"$f":"IFERROR(VLOOKUP(H116,'Input Wonen'!$J$13:$N$151,COLUMNS('Input Wonen'!J:L),FALSE),\"\")","v":"Kanaalplaat, remontabel (28% recyclaat)"},null,"VL01.E",{"$f":"IFERROR(VLOOKUP(L116,'Input Wonen'!$P$13:$T$151,COLUMNS('Input Wonen'!P:Q),FALSE),\"\")","v":"BG: kanaalplaatvloer, 200mm incl. isolatie (Rc=3,7)"},{"$f":"IFERROR(VLOOKUP(L116,'Input Wonen'!$P$13:$T$151,COLUMNS('Input Wonen'!P:R),FALSE),\"\")","v":"Kanaalplaat, remontabel (28% recyclaat)"}]
[null,null,null,"VL02.t",{"$f":"VLOOKUP(D117,'Input Wonen'!$D$13:$H$151,2,FALSE)","v":"Dekvloeren, 60mm"},{"$f":"VLOOKUP(D117,'Input Wonen'!$D$13:$H$151,3,FALSE)","v":"Zandcement dekvloer"},null,"VL02.HNN",{"$f":"IFERROR(VLOOKUP(H117,'Input Wonen'!$J$13:$N$151,COLUMNS('Input Wonen'!J:K),FALSE),\"\")","v":"Dekvloeren, 60mm"},{"$f":"IFERROR(VLOOKUP(H117,'Input Wonen'!$J$13:$N$151,COLUMNS('Input Wonen'!J:L),FALSE),\"\")","v":"Fermacell honingraatvloer (op houten vloer)"},null,"VL02.E",{"$f":"IFERROR(VLOOKUP(L117,'Input Wonen'!$P$13:$T$151,COLUMNS('Input Wonen'!P:Q),FALSE),\"\")","v":"Dekvloeren, 60mm"},{"$f":"IFERROR(VLOOKUP(L117,'Input Wonen'!$P$13:$T$151,COLUMNS('Input Wonen'!P:R),FALSE),\"\")","v":"Fermacell honingraatvloer (op houten vloer)"}]
[null,null,null,"VL03.t",{"$f":"VLOOKUP(D118,'Input Wonen'!$D$13:$H$151,2,FALSE)","v":"Vloertegelwerk toilet"},{"$f":"VLOOKUP(D118,'Input Wonen'!$D$13:$H$151,3,FALSE)","v":"Keramische tegels, geglazuurd/gelijmd"},null,"VL03.HNN",{"$f":"IFERROR(VLOOKUP(H118,'Input Wonen'!$J$13:$N$151,COLUMNS('Input Wonen'!J:K),FALSE),\"\")","v":"Vloertegelwerk toilet"},{"$f":"IFERROR(VLOOKUP(H118,'Input Wonen'!$J$13:$N$151,COLUMNS('Input Wonen'!J:L),FALSE),\"\")","v":"Mosa C2C vloertegels"},null,"VL03.E",{"$f":"IFERROR(VLOOKUP(L118,'Input Wonen'!$P$13:$T$151,COLUMNS('Input Wonen'!P:Q),FALSE),\"\")","v":"Vloertegelwerk toilet"},{"$f":"IFERROR(VLOOKUP(L118,'Input Wonen'!$P$13:$T$151,COLUMNS('Input Wonen'!P:R),FALSE),\"\")","v":"Mosa C2C vloertegels (losmaakbaar)"}]
[null,null,null,"VL20.t",{"$f":"VLOOKUP(D119,'Input Wonen'!$D$13:$H$151,2,FALSE)","v":"VV: kanaalplaatvloer, 200mm"},{"$f":"VLOOKUP(D119,'Input Wonen'!$D$13:$H$151,3,FALSE)","v":"Kanaalplaatvloer; prefab beton"},null,"VL20.HNN",{"$f":"IFERROR(VLOOKUP(H119,'Input Wonen'!$J$13:$N$151,COLUMNS('Input Wonen'!J:K),FALSE),\"\")","v":"VV: kanaalplaatvloer, 200mm"},{"$f":"IFERROR(VLOOKUP(H119,'Input Wonen'!$J$13:$N$151,COLUMNS('Input Wonen'!J:L),FALSE),\"\")","v":"Kanaalplaatvloer, 200mm (28% recyclaat)"},null,"VL20.E",{"$f":"IFERROR(VLOOKUP(L119,'Input Wonen'!$P$13:$T$151,COLUMNS('Input Wonen'!P:Q),FALSE),\"\")","v":"VV: HSB (grondgeb.) "},{"$f":"IFERROR(VLOOKUP(L119,'Input Wonen'!$P$13:$T$151,COLUMNS('Input Wonen'!P:R),FALSE),\"\")","v":"HSB vloerelement (stijlen+OSB), 18mm; IsoVlas 60mm; gipsplaat (2x)"}]
[null,null,null,"VL07.t",{"$f":"VLOOKUP(D120,'Input Wonen'!$D$13:$H$151,2,FALSE)","v":"Dekvloeren, 60mm"},{"$f":"VLOOKUP(D120,'Input Wonen'!$D$13:$H$151,3,FALSE)","v":"Zandcement dekvloer"},null,"VL07.HNN",{"$f":"IFERROR(VLOOKUP(H120,'Input Wonen'!$J$13:$N$151,COLUMNS('Input Wonen'!J:K),FALSE),\"\")","v":"Dekvloeren, 60mm"},{"$f":"IFERROR(VLOOKUP(H120,'Input Wonen'!$J$13:$N$151,COLUMNS('Input Wonen'!J:L),FALSE),\"\")","v":"Fermacell honingraatvloer (op houten vloer)"},null,"VL07.E",{"$f":"IFERROR(VLOOKUP(L120,'Input Wonen'!$P$13:$T$151,COLUMNS('Input Wonen'!P:Q),FALSE),\"\")","v":"Dekvloeren, 60mm"},{"$f":"IFERROR(VLOOKUP(L120,'Input Wonen'!$P$13:$T$151,COLUMNS('Input Wonen'!P:R),FALSE),\"\")","v":"Fermacell honingraatvloer (op houten vloer)"}]
[null,null,null,"VL04.t",{"$f":"VLOOKUP(D121,'Input Wonen'!$D$13:$H$151,2,FALSE)","v":"Vloertegelwerk badkamer"},{"$f":"VLOOKUP(D121,'Input Wonen'!$D$13:$H$151,3,FALSE)","v":"Keramische tegels, geglazuurd/gelijmd"},null,"VL04.HNN",{"$f":"IFERROR(VLOOKUP(H121,'Input Wonen'!$J$13:$N$151,COLUMNS('Input Wonen'!J:K),FALSE),\"\")","v":"Vloertegelwerk badkamer"},{"$f":"IFERROR(VLOOKUP(H121,'Input Wonen'!$J$13:$N$151,COLUMNS('Input Wonen'!J:L),FALSE),\"\")","v":"Mosa C2C vloertegels"},null,"VL04.E",{"$f":"IFERROR(VLOOKUP(L121,'Input Wonen'!$P$13:$T$151,COLUMNS('Input Wonen'!P:Q),FALSE),\"\")","v":"Vloertegelwerk badkamer"},{"$f":"IFERROR(VLOOKUP(L121,'Input Wonen'!$P$13:$T$151,COLUMNS('Input Wonen'!P:R),FALSE),\"\")","v":"Mosa C2C vloertegels (losmaakbaar)"}]
[null,null,null,null,"Gevel",null,null,null,"Gevel",null,null,null,"Gevel"]
[null,null,null,"GE50.t",{"$f":"VLOOKUP(D123,'Input Wonen'!$D$13:$H$151,2,FALSE)","v":"Gevelkozijnen; incl. HR++ beglazing"},{"$f":"VLOOKUP(D123,'Input Wonen'!$D$13:$H$151,3,FALSE)","v":"Az. loofhout (Meranti), geschilderd"},null,"GE50.HNN",{"$f":"IFERROR(VLOOKUP(H123,'Input Wonen'!$J$13:$N$151,COLUMNS('Input Wonen'!J:K),FALSE),\"\")","v":"Gevelkozijnen; incl. HR++ beglazing"},{"$f":"IFERROR(VLOOKUP(H123,'Input Wonen'!$J$13:$N$151,COLUMNS('Input Wonen'!J:L),FALSE),\"\")","v":"Europees naaldhout, geschilderd"},null,"GE50.E",{"$f":"IFERROR(VLOOKUP(L123,'Input Wonen'!$P$13:$T$151,COLUMNS('Input Wonen'!P:Q),FALSE),\"\")","v":"Gevelkozijnen; incl. Isomax beglazing"},{"$f":"IFERROR(VLOOKUP(L123,'Input Wonen'!$P$13:$T$151,COLUMNS('Input Wonen'!P:R),FALSE),\"\")","v":"Europees naaldhout, geschilderd"}]
[null,null,null,"GE03.t",{"$f":"VLOOKUP(D124,'Input Wonen'!$D$13:$H$151,2,FALSE)","v":"Stelkozijnen"},{"$f":"VLOOKUP(D124,'Input Wonen'!$D$13:$H$151,3,FALSE)","v":"Onverduurzaamd hout, geverfd"},null,"GE03.HNN",{"$f":"IFERROR(VLOOKUP(H124,'Input Wonen'!$J$13:$N$151,COLUMNS('Input Wonen'!J:K),FALSE),\"\")","v":"Stelkozijnen"},{"$f":"IFERROR(VLOOKUP(H124,'Input Wonen'!$J$13:$N$151,COLUMNS('Input Wonen'!J:L),FALSE),\"\")","v":"Onverduurzaamd hout, geverfd"},null,"GE03.E",{"$f":"IFERROR(VLOOKUP(L124,'Input Wonen'!$P$13:$T$151,COLUMNS('Input Wonen'!P:Q),FALSE),\"\")","v":"Stelkozijnen"},{"$f":"IFERROR(VLOOKUP(L124,'Input Wonen'!$P$13:$T$151,COLUMNS('Input Wonen'!P:R),FALSE),\"\")","v":"Onverduurzaamd hout, geverfd"}]
[null,null,null,"GE04.t",{"$f":"VLOOKUP(D125,'Input Wonen'!$D$13:$H$151,2,FALSE)","v":"Vensterbanken"},{"$f":"VLOOKUP(D125,'Input Wonen'!$D$13:$H$151,3,FALSE)","v":"Composietsteen "},null,"GE04.HNN",{"$f":"IFERROR(VLOOKUP(H125,'Input Wonen'!$J$13:$N$151,COLUMNS('Input Wonen'!J:K),FALSE),\"\")","v":"Vensterbanken"},{"$f":"IFERROR(VLOOKUP(H125,'Input Wonen'!$J$13:$N$151,COLUMNS('Input Wonen'!J:L),FALSE),\"\")","v":"Composietsteen"},null,"GE04.E",{"$f":"IFERROR(VLOOKUP(L125,'Input Wonen'!$P$13:$T$151,COLUMNS('Input Wonen'!P:Q),FALSE),\"\")","v":"Vensterbanken"},{"$f":"IFERROR(VLOOKUP(L125,'Input Wonen'!$P$13:$T$151,COLUMNS('Input Wonen'!P:R),FALSE),\"\")","v":"Composietsteen"}]
[null,null,null,"GE05.t",{"$f":"VLOOKUP(D126,'Input Wonen'!$D$13:$H$151,2,FALSE)","v":"Waterslagen"},{"$f":"VLOOKUP(D126,'Input Wonen'!$D$13:$H$151,3,FALSE)","v":"Prefab beton"},null,"GE05.HNN",{"$f":"IFERROR(VLOOKUP(H126,'Input Wonen'!$J$13:$N$151,COLUMNS('Input Wonen'!J:K),FALSE),\"\")","v":"Waterslagen"},{"$f":"IFERROR(VLOOKUP(H126,'Input Wonen'!$J$13:$N$151,COLUMNS('Input Wonen'!J:L),FALSE),\"\")","v":"Prefab beton"},null,"GE05.E",{"$f":"IFERROR(VLOOKUP(L126,'Input Wonen'!$P$13:$T$151,COLUMNS('Input Wonen'!P:Q),FALSE),\"\")","v":"Waterslagen"},{"$f":"IFERROR(VLOOKUP(L126,'Input Wonen'!$P$13:$T$151,COLUMNS('Input Wonen'!P:R),FALSE),\"\")","v":"Prefab beton"}]
[null,null,null,"GE22.t",{"$f":"VLOOKUP(D127,'Input Wonen'!$D$13:$H$151,2,FALSE)","v":"Lateien"},{"$f":"VLOOKUP(D127,'Input Wonen'!$D$13:$H$151,3,FALSE)","v":"Prefab beton"},null,"GE22.HNN",{"$f":"IFERROR(VLOOKUP(H127,'Input Wonen'!$J$13:$N$151,COLUMNS('Input Wonen'!J:K),FALSE),\"\")","v":"Lateien"},{"$f":"IFERROR(VLOOKUP(H127,'Input Wonen'!$J$13:$N$151,COLUMNS('Input Wonen'!J:L),FALSE),\"\")","v":"Prefab beton"},null,"GE22.E",{"$f":"IFERROR(VLOOKUP(L127,'Input Wonen'!$P$13:$T$151,COLUMNS('Input Wonen'!P:Q),FALSE),\"\")","v":"Lateien"},{"$f":"IFERROR(VLOOKUP(L127,'Input Wonen'!$P$13:$T$151,COLUMNS('Input Wonen'!P:R),FALSE),\"\")","v":"Prefab beton"}]
[null,null,null,"GE08.t",{"$f":"VLOOKUP(D128,'Input Wonen'!$D$13:$H$151,2,FALSE)","v":"Buitendeur; incl. glasopening 0,85m2"},{"$f":"VLOOKUP(D128,'Input Wonen'!$D$13:$H$151,3,FALSE)","v":"Onverduurzaamd hout, geverfd"},null,"GE08.HNN",{"$f":"IFERROR(VLOOKUP(H128,'Input Wonen'!$J$13:$N$151,COLUMNS('Input Wonen'!J:K),FALSE),\"\")","v":"Buitendeur; incl. glasopening 0,85m2"},{"$f":"IFERROR(VLOOKUP(H128,'Input Wonen'!$J$13:$N$151,COLUMNS('Input Wonen'!J:L),FALSE),\"\")","v":"Onverduurzaamd hout, geverfd"},null,"GE08.E",{"$f":"IFERROR(VLOOKUP(L128,'Input Wonen'!$P$13:$T$151,COLUMNS('Input Wonen'!P:Q),FALSE),\"\")","v":"Buitendeur; incl. glasopening 0,85m2"},{"$f":"IFERROR(VLOOKUP(L128,'Input Wonen'!$P$13:$T$151,COLUMNS('Input Wonen'!P:R),FALSE),\"\")","v":"Onverduurzaamd hout, geverfd"}]
[null,null,null,"GE09.t",{"$f":"VLOOKUP(D129,'Input Wonen'!$D$13:$H$151,2,FALSE)","v":"Buitenspouwblad, 100mm"},{"$f":"VLOOKUP(D129,'Input Wonen'!$D$13:$H$151,3,FALSE)","v":"Baksteenmetselwerk"},null,"GE09.HNN",{"$f":"IFERROR(VLOOKUP(H129,'Input Wonen'!$J$13:$N$151,COLUMNS('Input Wonen'!J:K),FALSE),\"\")","v":"Buitenspouwblad"},{"$f":"IFERROR(VLOOKUP(H129,'Input Wonen'!$J$13:$N$151,COLUMNS('Input Wonen'!J:L),FALSE),\"\")","v":"Ecobrick Wienerberger"},null,"GE09.E",{"$f":"IFERROR(VLOOKUP(L129,'Input Wonen'!$P$13:$T$151,COLUMNS('Input Wonen'!P:Q),FALSE),\"\")","v":"Buitenspouwblad"},{"$f":"IFERROR(VLOOKUP(L129,'Input Wonen'!$P$13:$T$151,COLUMNS('Input Wonen'!P:R),FALSE),\"\")","v":"Houten gevelbekleding; Meranti delen"}]
[null,null,null,"GE10.t",{"$f":"VLOOKUP(D130,'Input Wonen'!$D$13:$H$151,2,FALSE)","v":"Isolatielagen, Rc=4,7"},{"$f":"VLOOKUP(D130,'Input Wonen'!$D$13:$H$151,3,FALSE)","v":"PUR/PIR schuimplaten"},null,"GE10.HNN",{"$f":"IFERROR(VLOOKUP(H130,'Input Wonen'!$J$13:$N$151,COLUMNS('Input Wonen'!J:K),FALSE),\"\")","v":"Isolatielagen, Rc=4,7"},{"$f":"IFERROR(VLOOKUP(H130,'Input Wonen'!$J$13:$N$151,COLUMNS('Input Wonen'!J:L),FALSE),\"\")","v":"Isovlas plaat, PN160mm"},null,"GE10.E",{"$f":"IFERROR(VLOOKUP(L130,'Input Wonen'!$P$13:$T$151,COLUMNS('Input Wonen'!P:Q),FALSE),\"\")","v":"Isolatielagen, Rc=4,7"},{"$f":"IFERROR(VLOOKUP(L130,'Input Wonen'!$P$13:$T$151,COLUMNS('Input Wonen'!P:R),FALSE),\"\")","v":"Isovlas plaat, PN160mm"}]
[null,null,null,"GE11.t",{"$f":"VLOOKUP(D131,'Input Wonen'!$D$13:$H$151,2,FALSE)","v":"Binnenspouwblad, 100mm (bruto)"},{"$f":"VLOOKUP(D131,'Input Wonen'!$D$13:$H$151,3,FALSE)","v":"Prefab beton"},null,"GE11.HNN",{"$f":"IFERROR(VLOOKUP(H131,'Input Wonen'!$J$13:$N$151,COLUMNS('Input Wonen'!J:K),FALSE),\"\")","v":"Binnenspouwblad, 100mm (bruto)"},{"$f":"IFERROR(VLOOKUP(H131,'Input Wonen'!$J$13:$N$151,COLUMNS('Input Wonen'!J:L),FALSE),\"\")","v":"Prefab beton (UMC)"},null,"GE11.E",{"$f":"IFERROR(VLOOKUP(L131,'Input Wonen'!$P$13:$T$151,COLUMNS('Input Wonen'!P:Q),FALSE),\"\")","v":"Binnenspouwblad, HSB (bruto)"},{"$f":"IFERROR(VLOOKUP(L131,'Input Wonen'!$P$13:$T$151,COLUMNS('Input Wonen'!P:R),FALSE),\"\")","v":"HSB element incl. Isovlas isolatie"}]
[null,null,null,null,"Daken",null,null,null,"Daken",null,null,null,"Daken"]
[null,null,null,"DA01.t",{"$f":"VLOOKUP(D133,'Input Wonen'!$D$13:$H$151,2,FALSE)","v":"Dakconstructie, hellend; Rc=6,3"},{"$f":"VLOOKUP(D133,'Input Wonen'!$D$13:$H$151,3,FALSE)","v":"Prefab houten dakelement"},null,"DA01.HNN",{"$f":"IFERROR(VLOOKUP(H133,'Input Wonen'!$J$13:$N$151,COLUMNS('Input Wonen'!J:K),FALSE),\"\")","v":"Dakconstructie, hellend; Rc=6,3"},{"$f":"IFERROR(VLOOKUP(H133,'Input Wonen'!$J$13:$N$151,COLUMNS('Input Wonen'!J:L),FALSE),\"\")","v":"HSB hellenddakelement incl. vlasisolatie"},null,"DA01.E",{"$f":"IFERROR(VLOOKUP(L133,'Input Wonen'!$P$13:$T$151,COLUMNS('Input Wonen'!P:Q),FALSE),\"\")","v":"Dakconstructie, hellend; Rc=6,3"},{"$f":"IFERROR(VLOOKUP(L133,'Input Wonen'!$P$13:$T$151,COLUMNS('Input Wonen'!P:R),FALSE),\"\")","v":"HSB hellenddakelement incl. vlasisolatie"}]
[null,null,null,"DA06.t",{"$f":"VLOOKUP(D134,'Input Wonen'!$D$13:$H$151,2,FALSE)","v":"Dakafwerking"},{"$f":"VLOOKUP(D134,'Input Wonen'!$D$13:$H$151,3,FALSE)","v":"Betonpan"},null,"DA06.HNN",{"$f":"IFERROR(VLOOKUP(H134,'Input Wonen'!$J$13:$N$151,COLUMNS('Input Wonen'!J:K),FALSE),\"\")","v":"Dakafwerking"},{"$f":"IFERROR(VLOOKUP(H134,'Input Wonen'!$J$13:$N$151,COLUMNS('Input Wonen'!J:L),FALSE),\"\")","v":"Hergebruikte keramische pan"},null,"DA06.E",{"$f":"IFERROR(VLOOKUP(L134,'Input Wonen'!$P$13:$T$151,COLUMNS('Input Wonen'!P:Q),FALSE),\"\")","v":"Dakafwerking"},{"$f":"IFERROR(VLOOKUP(L134,'Input Wonen'!$P$13:$T$151,COLUMNS('Input Wonen'!P:R),FALSE),\"\")","v":"Hergebruikte keramische pan"}]
[null,null,null,"DA13.t",{"$f":"VLOOKUP(D135,'Input Wonen'!$D$13:$H$151,2,FALSE)","v":"Bekledingen en roosters verlaagde plafonds"},{"$f":"VLOOKUP(D135,'Input Wonen'!$D$13:$H$151,3,FALSE)","v":"Spaanplaat (incl. regelwerk)"},null,"DA13.HNN",{"$f":"IFERROR(VLOOKUP(H135,'Input Wonen'!$J$13:$N$151,COLUMNS('Input Wonen'!J:K),FALSE),\"\")","v":"Bekleding en roosters, refurbished plafondplaten (Insert)"},{"$f":"IFERROR(VLOOKUP(H135,'Input Wonen'!$J$13:$N$151,COLUMNS('Input Wonen'!J:L),FALSE),\"\")","v":"Hergebruikte / refurbished plafondplaten"},null,"DA13.E",{"$f":"IFERROR(VLOOKUP(L135,'Input Wonen'!$P$13:$T$151,COLUMNS('Input Wonen'!P:Q),FALSE),\"\")","v":"Bekleding en roosters, refurbished plafondplaten (Insert)"},{"$f":"IFERROR(VLOOKUP(L135,'Input Wonen'!$P$13:$T$151,COLUMNS('Input Wonen'!P:R),FALSE),\"\")","v":"Hergebruikte / refurbished plafondplaten"}]
[null,null,null,null,"Binnenwanden",null,null,null,"Binnenwanden",null,null,null,"Binnenwanden"]
[null,null,null,"BI02.t",{"$f":"VLOOKUP(D137,'Input Wonen'!$D$13:$H$151,2,FALSE)","v":"Woningscheidende wanden, 100mm;"},{"$f":"VLOOKUP(D137,'Input Wonen'!$D$13:$H$151,3,FALSE)","v":"Prefab beton"},null,"BI02.HNN",{"$f":"IFERROR(VLOOKUP(H137,'Input Wonen'!$J$13:$N$151,COLUMNS('Input Wonen'!J:K),FALSE),\"\")","v":"Woningscheidende wanden, 100mm;"},{"$f":"IFERROR(VLOOKUP(H137,'Input Wonen'!$J$13:$N$151,COLUMNS('Input Wonen'!J:L),FALSE),\"\")","v":"Prefab beton"},null,"BI02.E",{"$f":"IFERROR(VLOOKUP(L137,'Input Wonen'!$P$13:$T$151,COLUMNS('Input Wonen'!P:Q),FALSE),\"\")","v":"Woningscheidende wanden, HSB"},{"$f":"IFERROR(VLOOKUP(L137,'Input Wonen'!$P$13:$T$151,COLUMNS('Input Wonen'!P:R),FALSE),\"\")","v":"HSB binnenwand element met vlasisolatie"}]
[null,null,null,"BI04.t",{"$f":"VLOOKUP(D138,'Input Wonen'!$D$13:$H$151,2,FALSE)","v":"Wandtegelwerk badkamer, toilet en keuken"},{"$f":"VLOOKUP(D138,'Input Wonen'!$D$13:$H$151,3,FALSE)","v":"Keramische tegels; geglazuurd/gelijmd"},null,"BI04.HNN",{"$f":"IFERROR(VLOOKUP(H138,'Input Wonen'!$J$13:$N$151,COLUMNS('Input Wonen'!J:K),FALSE),\"\")","v":"Wandtegelwerk badkamer, toilet en keuken"},{"$f":"IFERROR(VLOOKUP(H138,'Input Wonen'!$J$13:$N$151,COLUMNS('Input Wonen'!J:L),FALSE),\"\")","v":"Mosa C2C wandtegels"},null,"BI04.E",{"$f":"IFERROR(VLOOKUP(L138,'Input Wonen'!$P$13:$T$151,COLUMNS('Input Wonen'!P:Q),FALSE),\"\")","v":"Wandtegelwerk badkamer, toilet en keuken"},{"$f":"IFERROR(VLOOKUP(L138,'Input Wonen'!$P$13:$T$151,COLUMNS('Input Wonen'!P:R),FALSE),\"\")","v":"Gerecycled PET i.c.m. Quartz"}]
[null,null,null,"BI14.t",{"$f":"VLOOKUP(D139,'Input Wonen'!$D$13:$H$151,2,FALSE)","v":"Systeemwanden; gipskartonplaat, 100mm"},{"$f":"VLOOKUP(D139,'Input Wonen'!$D$13:$H$151,3,FALSE)","v":"Enkel beplaat, 60 mm glaswol"},null,"BI14.HNN",{"$f":"IFERROR(VLOOKUP(H139,'Input Wonen'!$J$13:$N$151,COLUMNS('Input Wonen'!J:K),FALSE),\"\")","v":"Binnenwanden, 35mm"},{"$f":"IFERROR(VLOOKUP(H139,'Input Wonen'!$J$13:$N$151,COLUMNS('Input Wonen'!J:L),FALSE),\"\")","v":"Faay volpaneel"},null,"BI14.E",{"$f":"IFERROR(VLOOKUP(L139,'Input Wonen'!$P$13:$T$151,COLUMNS('Input Wonen'!P:Q),FALSE),\"\")","v":"Binnenwanden, 54mm"},{"$f":"IFERROR(VLOOKUP(L139,'Input Wonen'!$P$13:$T$151,COLUMNS('Input Wonen'!P:R),FALSE),\"\")","v":"Faay volpaneel; enkel beplaat"}]
[null,null,null,"BI05.t",{"$f":"VLOOKUP(D140,'Input Wonen'!$D$13:$H$151,2,FALSE)","v":"Binnenwanden, 70mm"},{"$f":"VLOOKUP(D140,'Input Wonen'!$D$13:$H$151,3,FALSE)","v":"Gipsblokken, normale dichtheid"},null,"BI05.HNN",{"$f":"IFERROR(VLOOKUP(H140,'Input Wonen'!$J$13:$N$151,COLUMNS('Input Wonen'!J:K),FALSE),\"\")","v":"Binnenwanden, 70mm"},{"$f":"IFERROR(VLOOKUP(H140,'Input Wonen'!$J$13:$N$151,COLUMNS('Input Wonen'!J:L),FALSE),\"\")","v":"Faay volpaneel"},null,"BI05.E",{"$f":"IFERROR(VLOOKUP(L140,'Input Wonen'!$P$13:$T$151,COLUMNS('Input Wonen'!P:Q),FALSE),\"\")","v":"Binnenwanden, 70mm"},{"$f":"IFERROR(VLOOKUP(L140,'Input Wonen'!$P$13:$T$151,COLUMNS('Input Wonen'!P:R),FALSE),\"\")","v":"Faay volpaneel"}]
[null,null,null,"BI06.t",{"$f":"VLOOKUP(D141,'Input Wonen'!$D$13:$H$151,2,FALSE)","v":"Binnenwanden, 70mm"},{"$f":"VLOOKUP(D141,'Input Wonen'!$D$13:$H$151,3,FALSE)","v":"Gipsblokken, hoge dichtheid"},null,"BI06.HNN",{"$f":"IFERROR(VLOOKUP(H141,'Input Wonen'!$J$13:$N$151,COLUMNS('Input Wonen'!J:K),FALSE),\"\")","v":"Binnenwanden, 70mm"},{"$f":"IFERROR(VLOOKUP(H141,'Input Wonen'!$J$13:$N$151,COLUMNS('Input Wonen'!J:L),FALSE),\"\")","v":"Faay volpaneel"},null,"BI06.E",{"$f":"IFERROR(VLOOKUP(L141,'Input Wonen'!$P$13:$T$151,COLUMNS('Input Wonen'!P:Q),FALSE),\"\")","v":"Binnenwanden, 70mm"},{"$f":"IFERROR(VLOOKUP(L141,'Input Wonen'!$P$13:$T$151,COLUMNS('Input Wonen'!P:R),FALSE),\"\")","v":"Faay volpaneel"}]
[null,null,null,"BI11.t",{"$f":"VLOOKUP(D142,'Input Wonen'!$D$13:$H$151,2,FALSE)","v":"Binnenkozijnen"},{"$f":"VLOOKUP(D142,'Input Wonen'!$D$13:$H$151,3,FALSE)","v":"Staal; verzinkt+gemoffeld"},null,"BI11.HNN",{"$f":"IFERROR(VLOOKUP(H142,'Input Wonen'!$J$13:$N$151,COLUMNS('Input Wonen'!J:K),FALSE),\"\")","v":"Binnenkozijnen"},{"$f":"IFERROR(VLOOKUP(H142,'Input Wonen'!$J$13:$N$151,COLUMNS('Input Wonen'!J:L),FALSE),\"\")","v":"Europees naaldhout, geschilderd"},null,"BI11.E",{"$f":"IFERROR(VLOOKUP(L142,'Input Wonen'!$P$13:$T$151,COLUMNS('Input Wonen'!P:Q),FALSE),\"\")","v":"Binnenkozijnen"},{"$f":"IFERROR(VLOOKUP(L142,'Input Wonen'!$P$13:$T$151,COLUMNS('Input Wonen'!P:R),FALSE),\"\")","v":"Europees naaldhout, geschilderd"}]
[null,null,null,"BI08.t",{"$f":"VLOOKUP(D143,'Input Wonen'!$D$13:$H$151,2,FALSE)","v":"Binnendeuren"},{"$f":"VLOOKUP(D143,'Input Wonen'!$D$13:$H$151,3,FALSE)","v":"Honingraat; vlakke binnendeur"},null,"BI08.HNN",{"$f":"IFERROR(VLOOKUP(H143,'Input Wonen'!$J$13:$N$151,COLUMNS('Input Wonen'!J:K),FALSE),\"\")","v":"Binnendeuren"},{"$f":"IFERROR(VLOOKUP(H143,'Input Wonen'!$J$13:$N$151,COLUMNS('Input Wonen'!J:L),FALSE),\"\")","v":"Honingraat; vlakke binnendeur"},null,"BI08.E",{"$f":"IFERROR(VLOOKUP(L143,'Input Wonen'!$P$13:$T$151,COLUMNS('Input Wonen'!P:Q),FALSE),\"\")","v":"Binnendeuren"},{"$f":"IFERROR(VLOOKUP(L143,'Input Wonen'!$P$13:$T$151,COLUMNS('Input Wonen'!P:R),FALSE),\"\")","v":"Honingraat; vlakke binnendeur"}]
[null,null,null,"BI10.t",{"$f":"VLOOKUP(D144,'Input Wonen'!$D$13:$H$151,2,FALSE)","v":"Binnendorpels"},{"$f":"VLOOKUP(D144,'Input Wonen'!$D$13:$H$151,3,FALSE)","v":"Gegoten composietsteen"},null,"BI10.HNN",{"$f":"IFERROR(VLOOKUP(H144,'Input Wonen'!$J$13:$N$151,COLUMNS('Input Wonen'!J:K),FALSE),\"\")","v":"Binnendorpels"},{"$f":"IFERROR(VLOOKUP(H144,'Input Wonen'!$J$13:$N$151,COLUMNS('Input Wonen'!J:L),FALSE),\"\")","v":"Kunststeen"},null,"BI10.E",{"$f":"IFERROR(VLOOKUP(L144,'Input Wonen'!$P$13:$T$151,COLUMNS('Input Wonen'!P:Q),FALSE),\"\")","v":"Binnendorpels"},{"$f":"IFERROR(VLOOKUP(L144,'Input Wonen'!$P$13:$T$151,COLUMNS('Input Wonen'!P:R),FALSE),\"\")","v":"Kunststeen"}]
[null,null,null,null,"Klimaatinstallaties",null,null,null,"Klimaatinstallaties",null,null,null,"Klimaatinstallaties"]
[null,null,null,"KL02.t",{"$f":"VLOOKUP(D146,'Input Wonen'!$D$13:$H$151,2,FALSE)","v":"Warmtedistributiesysteem"},{"$f":"VLOOKUP(D146,'Input Wonen'!$D$13:$H$151,3,FALSE)","v":"CV-leidingen incl. koppelingen + verdeling"},null,"KL02.HNN",{"$f":"IFERROR(VLOOKUP(H146,'Input Wonen'!$J$13:$N$151,COLUMNS('Input Wonen'!J:K),FALSE),\"\")","v":"Warmtedistributiesysteem"},{"$f":"IFERROR(VLOOKUP(H146,'Input Wonen'!$J$13:$N$151,COLUMNS('Input Wonen'!J:L),FALSE),\"\")","v":"CV-leidingen incl. koppelingen + verdeling"},null,"KL02.E",{"$f":"IFERROR(VLOOKUP(L146,'Input Wonen'!$P$13:$T$151,COLUMNS('Input Wonen'!P:Q),FALSE),\"\")","v":"Warmtedistributiesysteem"},{"$f":"IFERROR(VLOOKUP(L146,'Input Wonen'!$P$13:$T$151,COLUMNS('Input Wonen'!P:R),FALSE),\"\")","v":"CV-leidingen incl. koppelingen + verdeling"}]
[null,null,null,"KL03.t",{"$f":"VLOOKUP(D147,'Input Wonen'!$D$13:$H$151,2,FALSE)","v":"Warmteafgiftesysteem"},{"$f":"VLOOKUP(D147,'Input Wonen'!$D$13:$H$151,3,FALSE)","v":"Vloerverwarming 95 W/m2"},null,"KL03.HNN",{"$f":"IFERROR(VLOOKUP(H147,'Input Wonen'!$J$13:$N$151,COLUMNS('Input Wonen'!J:K),FALSE),\"\")","v":"Warmteafgiftesysteem"},{"$f":"IFERROR(VLOOKUP(H147,'Input Wonen'!$J$13:$N$151,COLUMNS('Input Wonen'!J:L),FALSE),\"\")","v":"Vloerverwarming 95 W/m2"},null,"KL03.E",{"$f":"IFERROR(VLOOKUP(L147,'Input Wonen'!$P$13:$T$151,COLUMNS('Input Wonen'!P:Q),FALSE),\"\")","v":"Warmteafgiftesysteem"},{"$f":"IFERROR(VLOOKUP(L147,'Input Wonen'!$P$13:$T$151,COLUMNS('Input Wonen'!P:R),FALSE),\"\")","v":"Vloerverwarming 95 W/m2 "}]
[null,null,null,"KL01.t",{"$f":"VLOOKUP(D148,'Input Wonen'!$D$13:$H$151,2,FALSE)","v":"Warmteopwekkinginstallatie"},{"$f":"VLOOKUP(D148,'Input Wonen'!$D$13:$H$151,3,FALSE)","v":"Warmtepomp luchtwater 10kW "},null,"KL01.HNN",{"$f":"IFERROR(VLOOKUP(H148,'Input Wonen'!$J$13:$N$151,COLUMNS('Input Wonen'!J:K),FALSE),\"\")","v":"Warmteopwekkinginstallatie"},{"$f":"IFERROR(VLOOKUP(H148,'Input Wonen'!$J$13:$N$151,COLUMNS('Input Wonen'!J:L),FALSE),\"\")","v":"Warmtepomp luchtwater 10kW "},null,"KL01.E",{"$f":"IFERROR(VLOOKUP(L148,'Input Wonen'!$P$13:$T$151,COLUMNS('Input Wonen'!P:Q),FALSE),\"\")","v":"Warmteopwekkinginstallatie"},{"$f":"IFERROR(VLOOKUP(L148,'Input Wonen'!$P$13:$T$151,COLUMNS('Input Wonen'!P:R),FALSE),\"\")","v":"Warmtepomp luchtwater 10kW "}]
[null,null,null,"KL05.t",{"$f":"VLOOKUP(D149,'Input Wonen'!$D$13:$H$151,2,FALSE)","v":"Luchtdistributiesysteem"},{"$f":"VLOOKUP(D149,'Input Wonen'!$D$13:$H$151,3,FALSE)","v":"VLA ventilatiesysteem, type D met centrale wtw; W-bouw, individueel"},null,"KL05.HNN",{"$f":"IFERROR(VLOOKUP(H149,'Input Wonen'!$J$13:$N$151,COLUMNS('Input Wonen'!J:K),FALSE),\"\")","v":"Luchtdistributiesysteem"},{"$f":"IFERROR(VLOOKUP(H149,'Input Wonen'!$J$13:$N$151,COLUMNS('Input Wonen'!J:L),FALSE),\"\")","v":"VLA ventilatiesysteem, type D met centrale wtw; W-bouw, individueel"},null,"KL05.E",{"$f":"IFERROR(VLOOKUP(L149,'Input Wonen'!$P$13:$T$151,COLUMNS('Input Wonen'!P:Q),FALSE),\"\")","v":"Luchtdistributiesysteem"},{"$f":"IFERROR(VLOOKUP(L149,'Input Wonen'!$P$13:$T$151,COLUMNS('Input Wonen'!P:R),FALSE),\"\")","v":"VLA ventilatiesysteem, type D met centrale wtw; W-bouw, individueel"}]
[null,null,null,null,"Elektrische installaties",null,null,null,"Elektrische installaties",null,null,null,"Elektrische installaties"]
[null,null,null,"EL01.t",{"$f":"VLOOKUP(D151,'Input Wonen'!$D$13:$H$151,2,FALSE)","v":"Elektriciteitsleidingen"},{"$f":"VLOOKUP(D151,'Input Wonen'!$D$13:$H$151,3,FALSE)","v":"Geïsoleerde installatiedraad + mantelbuis"},null,"EL01.HNN",{"$f":"IFERROR(VLOOKUP(H151,'Input Wonen'!$J$13:$N$151,COLUMNS('Input Wonen'!J:K),FALSE),\"\")","v":"Elektriciteitsleidingen"},{"$f":"IFERROR(VLOOKUP(H151,'Input Wonen'!$J$13:$N$151,COLUMNS('Input Wonen'!J:L),FALSE),\"\")","v":"Geïsoleerde installatiedraad + mantelbuis"},null,"EL01.E",{"$f":"IFERROR(VLOOKUP(L151,'Input Wonen'!$P$13:$T$151,COLUMNS('Input Wonen'!P:Q),FALSE),\"\")","v":"Elektriciteitsleidingen"},{"$f":"IFERROR(VLOOKUP(L151,'Input Wonen'!$P$13:$T$151,COLUMNS('Input Wonen'!P:R),FALSE),\"\")","v":"Geïsoleerde installatiedraad + mantelbuis"}]
[null,null,null,"EL02.t",{"$f":"VLOOKUP(D152,'Input Wonen'!$D$13:$H$151,2,FALSE)","v":"Pv-panelen, hellend dak"},{"$f":"VLOOKUP(D152,'Input Wonen'!$D$13:$H$151,3,FALSE)","v":"Mono-Si; incl. inverter+kabels"},null,"EL02.HNN",{"$f":"IFERROR(VLOOKUP(H152,'Input Wonen'!$J$13:$N$151,COLUMNS('Input Wonen'!J:K),FALSE),\"\")","v":"Pv-panelen, hellend dak"},{"$f":"IFERROR(VLOOKUP(H152,'Input Wonen'!$J$13:$N$151,COLUMNS('Input Wonen'!J:L),FALSE),\"\")","v":"Exasun Xglass"},null,"EL02.E",{"$f":"IFERROR(VLOOKUP(L152,'Input Wonen'!$P$13:$T$151,COLUMNS('Input Wonen'!P:Q),FALSE),\"\")","v":"Pv-panelen, hellend dak"},{"$f":"IFERROR(VLOOKUP(L152,'Input Wonen'!$P$13:$T$151,COLUMNS('Input Wonen'!P:R),FALSE),\"\")","v":"Exasun Xroof (deels tvv van dakpannen)"}]
[null,null,null,null,"Toe- en afvoeren",null,null,null,"Toe- en afvoeren",null,null,null,"Toe- en afvoeren"]
[null,null,null,"TO01.t",{"$f":"VLOOKUP(D154,'Input Wonen'!$D$13:$H$151,2,FALSE)","v":"Waterleidingen"},{"$f":"VLOOKUP(D154,'Input Wonen'!$D$13:$H$151,3,FALSE)","v":"Polyetheen; leiding+mantelbuis"},null,"TO01.HNN",{"$f":"IFERROR(VLOOKUP(H154,'Input Wonen'!$J$13:$N$151,COLUMNS('Input Wonen'!J:K),FALSE),\"\")","v":"Waterleidingen"},{"$f":"IFERROR(VLOOKUP(H154,'Input Wonen'!$J$13:$N$151,COLUMNS('Input Wonen'!J:L),FALSE),\"\")","v":"Polyetheen"},null,"TO01.E",{"$f":"IFERROR(VLOOKUP(L154,'Input Wonen'!$P$13:$T$151,COLUMNS('Input Wonen'!P:Q),FALSE),\"\")","v":"Waterleidingen"},{"$f":"IFERROR(VLOOKUP(L154,'Input Wonen'!$P$13:$T$151,COLUMNS('Input Wonen'!P:R),FALSE),\"\")","v":"Polyetheen"}]
[null,null,null,"TO02.t",{"$f":"VLOOKUP(D155,'Input Wonen'!$D$13:$H$151,2,FALSE)","v":"Buitenriolering kavel"},{"$f":"VLOOKUP(D155,'Input Wonen'!$D$13:$H$151,3,FALSE)","v":"PVC"},null,"TO02.HNN",{"$f":"IFERROR(VLOOKUP(H155,'Input Wonen'!$J$13:$N$151,COLUMNS('Input Wonen'!J:K),FALSE),\"\")","v":"Buitenriolering"},{"$f":"IFERROR(VLOOKUP(H155,'Input Wonen'!$J$13:$N$151,COLUMNS('Input Wonen'!J:L),FALSE),\"\")","v":"Gerecycled PVC (Pipelife)"},null,"TO02.E",{"$f":"IFERROR(VLOOKUP(L155,'Input Wonen'!$P$13:$T$151,COLUMNS('Input Wonen'!P:Q),FALSE),\"\")","v":"Buitenriolering"},{"$f":"IFERROR(VLOOKUP(L155,'Input Wonen'!$P$13:$T$151,COLUMNS('Input Wonen'!P:R),FALSE),\"\")","v":"Gerecycled PVC (Pipelife)"}]
[null,null,null,"TO03.t",{"$f":"VLOOKUP(D156,'Input Wonen'!$D$13:$H$151,2,FALSE)","v":"Binnenriolering"},{"$f":"VLOOKUP(D156,'Input Wonen'!$D$13:$H$151,3,FALSE)","v":"PVC"},null,"TO03.HNN",{"$f":"IFERROR(VLOOKUP(H156,'Input Wonen'!$J$13:$N$151,COLUMNS('Input Wonen'!J:K),FALSE),\"\")","v":"Binnenriolering"},{"$f":"IFERROR(VLOOKUP(H156,'Input Wonen'!$J$13:$N$151,COLUMNS('Input Wonen'!J:L),FALSE),\"\")","v":"Gerecycled PVC (Pipelife)"},null,"TO03.E",{"$f":"IFERROR(VLOOKUP(L156,'Input Wonen'!$P$13:$T$151,COLUMNS('Input Wonen'!P:Q),FALSE),\"\")","v":"Binnenriolering"},{"$f":"IFERROR(VLOOKUP(L156,'Input Wonen'!$P$13:$T$151,COLUMNS('Input Wonen'!P:R),FALSE),\"\")","v":"Gerecycled PVC (Pipelife)"}]
[null,null,null,"TO04.t",{"$f":"VLOOKUP(D157,'Input Wonen'!$D$13:$H$151,2,FALSE)","v":"Hemelwaterafvoer"},{"$f":"VLOOKUP(D157,'Input Wonen'!$D$13:$H$151,3,FALSE)","v":"PVC"},null,"TO04.HNN",{"$f":"IFERROR(VLOOKUP(H157,'Input Wonen'!$J$13:$N$151,COLUMNS('Input Wonen'!J:K),FALSE),\"\")","v":"Hemelwaterafvoer"},{"$f":"IFERROR(VLOOKUP(H157,'Input Wonen'!$J$13:$N$151,COLUMNS('Input Wonen'!J:L),FALSE),\"\")","v":"Gerecycled PVC (Pipelife)"},null,"TO04.E",{"$f":"IFERROR(VLOOKUP(L157,'Input Wonen'!$P$13:$T$151,COLUMNS('Input Wonen'!P:Q),FALSE),\"\")","v":"Hemelwaterafvoer"},{"$f":"IFERROR(VLOOKUP(L157,'Input Wonen'!$P$13:$T$151,COLUMNS('Input Wonen'!P:R),FALSE),\"\")","v":"Gerecycled PVC (Pipelife)"}]
[null,null,null,"TO05.t",{"$f":"VLOOKUP(D158,'Input Wonen'!$D$13:$H$151,2,FALSE)","v":"Dakgoot"},{"$f":"VLOOKUP(D158,'Input Wonen'!$D$13:$H$151,3,FALSE)","v":"Aluminium"},null,"TO05.HNN",{"$f":"IFERROR(VLOOKUP(H158,'Input Wonen'!$J$13:$N$151,COLUMNS('Input Wonen'!J:K),FALSE),\"\")","v":"Dakgoot"},{"$f":"IFERROR(VLOOKUP(H158,'Input Wonen'!$J$13:$N$151,COLUMNS('Input Wonen'!J:L),FALSE),\"\")","v":"Aluminium"},null,"TO05.E",{"$f":"IFERROR(VLOOKUP(L158,'Input Wonen'!$P$13:$T$151,COLUMNS('Input Wonen'!P:Q),FALSE),\"\")","v":"Dakgoot"},{"$f":"IFERROR(VLOOKUP(L158,'Input Wonen'!$P$13:$T$151,COLUMNS('Input Wonen'!P:R),FALSE),\"\")","v":"Aluminium"}]
[null,null,null,null,"Verkeersruimte",null,null,null,"Verkeersruimte",null,null,null,"Verkeersruimte"]
[null,null,null,"VE01.t",{"$f":"VLOOKUP(D160,'Input Wonen'!$D$13:$H$151,2,FALSE)","v":"Interne trap"},{"$f":"VLOOKUP(D160,'Input Wonen'!$D$13:$H$151,3,FALSE)","v":"Eur. loofhout; geschilderd"},null,"VE01.HNN",{"$f":"IFERROR(VLOOKUP(H160,'Input Wonen'!$J$13:$N$151,COLUMNS('Input Wonen'!J:K),FALSE),\"\")","v":"Interne trap"},{"$f":"IFERROR(VLOOKUP(H160,'Input Wonen'!$J$13:$N$151,COLUMNS('Input Wonen'!J:L),FALSE),\"\")","v":"Eur. loofhout; geschilderd"},null,"VE01.E",{"$f":"IFERROR(VLOOKUP(L160,'Input Wonen'!$P$13:$T$151,COLUMNS('Input Wonen'!P:Q),FALSE),\"\")","v":"Interne trap"},{"$f":"IFERROR(VLOOKUP(L160,'Input Wonen'!$P$13:$T$151,COLUMNS('Input Wonen'!P:R),FALSE),\"\")","v":"Eur. loofhout; geschilderd"}]
[null,null,null,"VE05.t",{"$f":"VLOOKUP(D161,'Input Wonen'!$D$13:$H$151,2,FALSE)","v":"Leuningen"},{"$f":"VLOOKUP(D161,'Input Wonen'!$D$13:$H$151,3,FALSE)","v":"Eur. loofhout; duurzame bosbouw"},null,"VE05.HNN",{"$f":"IFERROR(VLOOKUP(H161,'Input Wonen'!$J$13:$N$151,COLUMNS('Input Wonen'!J:K),FALSE),\"\")","v":"Leuningen"},{"$f":"IFERROR(VLOOKUP(H161,'Input Wonen'!$J$13:$N$151,COLUMNS('Input Wonen'!J:L),FALSE),\"\")","v":"Eur. loofhout; duurzame bosbouw"},null,"VE05.E",{"$f":"IFERROR(VLOOKUP(L161,'Input Wonen'!$P$13:$T$151,COLUMNS('Input Wonen'!P:Q),FALSE),\"\")","v":"Leuningen"},{"$f":"IFERROR(VLOOKUP(L161,'Input Wonen'!$P$13:$T$151,COLUMNS('Input Wonen'!P:R),FALSE),\"\")","v":"Eur. loofhout; duurzame bosbouw"}]
[null,null,null,"VE03.t",{"$f":"VLOOKUP(D162,'Input Wonen'!$D$13:$H$151,2,FALSE)","v":"Balustrades"},{"$f":"VLOOKUP(D162,'Input Wonen'!$D$13:$H$151,3,FALSE)","v":"Eur. loofhout; spijlen; duurzame bosbouw"},null,"VE03.HNN",{"$f":"IFERROR(VLOOKUP(H162,'Input Wonen'!$J$13:$N$151,COLUMNS('Input Wonen'!J:K),FALSE),\"\")","v":"Balustrades"},{"$f":"IFERROR(VLOOKUP(H162,'Input Wonen'!$J$13:$N$151,COLUMNS('Input Wonen'!J:L),FALSE),\"\")","v":"Eur. loofhout; spijlen; duurzame bosbouw"},null,"VE03.E",{"$f":"IFERROR(VLOOKUP(L162,'Input Wonen'!$P$13:$T$151,COLUMNS('Input Wonen'!P:Q),FALSE),\"\")","v":"Balustrades"},{"$f":"IFERROR(VLOOKUP(L162,'Input Wonen'!$P$13:$T$151,COLUMNS('Input Wonen'!P:R),FALSE),\"\")","v":"Eur. loofhout; spijlen; duurzame bosbouw"}]
[null,null,null,null,"Vaste voorzieningen",null,null,null,"Vaste voorzieningen",null,null,null,"Vaste voorzieningen"]
[null,null,null,"VA01.t",{"$f":"VLOOKUP(D164,'Input Wonen'!$D$13:$H$151,2,FALSE)","v":"Toiletten; wandcloset + fontein"},{"$f":"VLOOKUP(D164,'Input Wonen'!$D$13:$H$151,3,FALSE)","v":"Porselein"},null,"VA01.HNN",{"$f":"IFERROR(VLOOKUP(H164,'Input Wonen'!$J$13:$N$151,COLUMNS('Input Wonen'!J:K),FALSE),\"\")","v":"Toiletten; wandcloset + fontein"},{"$f":"IFERROR(VLOOKUP(H164,'Input Wonen'!$J$13:$N$151,COLUMNS('Input Wonen'!J:L),FALSE),\"\")","v":"Porselein"},null,"VA01.E",{"$f":"IFERROR(VLOOKUP(L164,'Input Wonen'!$P$13:$T$151,COLUMNS('Input Wonen'!P:Q),FALSE),\"\")","v":"Toiletten; wandcloset + fontein"},{"$f":"IFERROR(VLOOKUP(L164,'Input Wonen'!$P$13:$T$151,COLUMNS('Input Wonen'!P:R),FALSE),\"\")","v":"Porselein"}]
[null,null,null,"VA02.t",{"$f":"VLOOKUP(D165,'Input Wonen'!$D$13:$H$151,2,FALSE)","v":"Wastafel"},{"$f":"VLOOKUP(D165,'Input Wonen'!$D$13:$H$151,3,FALSE)","v":"Keramisch"},null,"VA02.HNN",{"$f":"IFERROR(VLOOKUP(H165,'Input Wonen'!$J$13:$N$151,COLUMNS('Input Wonen'!J:K),FALSE),\"\")","v":"Wastafel"},{"$f":"IFERROR(VLOOKUP(H165,'Input Wonen'!$J$13:$N$151,COLUMNS('Input Wonen'!J:L),FALSE),\"\")","v":"Keramisch"},null,"VA02.E",{"$f":"IFERROR(VLOOKUP(L165,'Input Wonen'!$P$13:$T$151,COLUMNS('Input Wonen'!P:Q),FALSE),\"\")","v":"Wastafel"},{"$f":"IFERROR(VLOOKUP(L165,'Input Wonen'!$P$13:$T$151,COLUMNS('Input Wonen'!P:R),FALSE),\"\")","v":"Keramisch"}]
[null,null,null,"VA03.t",{"$f":"VLOOKUP(D166,'Input Wonen'!$D$13:$H$151,2,FALSE)","v":"Inloopdouche"},{"$f":"VLOOKUP(D166,'Input Wonen'!$D$13:$H$151,3,FALSE)","v":"Gipsblokken + tegels incl. rvs afvoergoot"},null,"VA03.HNN",{"$f":"IFERROR(VLOOKUP(H166,'Input Wonen'!$J$13:$N$151,COLUMNS('Input Wonen'!J:K),FALSE),\"\")","v":"Inloopdouche"},{"$f":"IFERROR(VLOOKUP(H166,'Input Wonen'!$J$13:$N$151,COLUMNS('Input Wonen'!J:L),FALSE),\"\")","v":"Gipsblokken + tegels incl. rvs afvoergoot"},null,"VA03.E",{"$f":"IFERROR(VLOOKUP(L166,'Input Wonen'!$P$13:$T$151,COLUMNS('Input Wonen'!P:Q),FALSE),\"\")","v":"Inloopdouche"},{"$f":"IFERROR(VLOOKUP(L166,'Input Wonen'!$P$13:$T$151,COLUMNS('Input Wonen'!P:R),FALSE),\"\")","v":"Gipsblokken + tegels incl. rvs afvoergoot"}]
[null,null,null,null,"Overige kosten",null,null,null,"Overige kosten",null,null,null,"Overige kosten"]
[null,null,null,"OK01.t",{"$f":"VLOOKUP(D168,'Input Wonen'!$D$13:$H$165,2,FALSE)","v":"Grondwerk, maatvoering, invoeren en sparingen"},null,null,"OK01.HNN",{"$f":"VLOOKUP(H168,'Input Wonen'!$J$13:$N$165,2,FALSE)","v":"Grondwerk, maatvoering, invoeren en sparingen"},null,null,"OK01.E",{"$f":"VLOOKUP(H168,'Input Wonen'!$J$13:$N$165,2,FALSE)","v":"Grondwerk, maatvoering, invoeren en sparingen"}]
[null,null,null,"OK02.t",{"$f":"VLOOKUP(D169,'Input Wonen'!$D$13:$H$165,2,FALSE)","v":"Gevelsteiger"},{"$f":"VLOOKUP(D169,'Input Wonen'!$D$13:$H$165,3,FALSE)","v":0},null,"OK02.HNN",{"$f":"VLOOKUP(H169,'Input Wonen'!$J$13:$N$165,2,FALSE)","v":"Gevelsteiger"},null,null,"OK02.E",{"$f":"VLOOKUP(H169,'Input Wonen'!$J$13:$N$165,2,FALSE)","v":"Gevelsteiger"}]
[null,null,null,"OK04.t",{"$f":"VLOOKUP(D170,'Input Wonen'!$D$13:$H$165,2,FALSE)","v":"Afbouwwerkzaamheden (klein timmerwerk, schilderwerk)"},{"$f":"VLOOKUP(D170,'Input Wonen'!$D$13:$H$165,3,FALSE)","v":0},null,"OK04.HNN",{"$f":"VLOOKUP(H170,'Input Wonen'!$J$13:$N$165,2,FALSE)","v":"Afbouwwerkzaamheden (klein timmerwerk, schilderwerk)"},null,null,"OK04.E",{"$f":"VLOOKUP(H170,'Input Wonen'!$J$13:$N$165,2,FALSE)","v":"Afbouwwerkzaamheden (klein timmerwerk, schilderwerk)"}]
[null,null,null,"OK10b.t",{"$f":"VLOOKUP(D171,'Input Wonen'!$D$13:$H$168,2,FALSE)","v":"Installaties (E, W & klimaat) grondgebonden woning hoek"},{"$f":"VLOOKUP(D171,'Input Wonen'!$D$13:$H$168,3,FALSE)","v":0},null,"OK10b.HNN",{"$f":"VLOOKUP(H171,'Input Wonen'!$J$13:$N$168,2,FALSE)","v":"Installaties (E, W & klimaat) grondgebonden woning hoek"},null,null,"OK10b.E",{"$f":"VLOOKUP(D171,'Input Wonen'!$D$13:$H$168,2,FALSE)","v":"Installaties (E, W & klimaat) grondgebonden woning hoek"}]
[]
[null,null,null,null,null,null,null,null,null,{"$f":"100*PI()*0.15^2","v":7.0685834705770345}]
[null,null,null,null,"Traditioneel (RVO Referentieprojecten)",null,null,null,"Het Nieuwe Normaal",null,null,null,"Het Nieuwe Normaal ambitieus"]
[]
[null,null,null,null,"WONEN",null,null,null,"WONEN",null,null,null,"WONEN"]
[]
[]
[]
[]
[]
[]
[null,null,null,null,null,null,null,{"$f":"0.696-I183","v":0.61049999999999993},{"$f":"0.095-0.0095","v":8.5500000000000007E-2}]
[]
[]
[]
[]
[]
[]
[null,null,null,null,"Woning 2,5 laags",null,null,null,"Woning 2,5 laags",null,null,null,"Woning 2,5 laags"]
[null,null,null,null,"Element","Materialisatie",null,null,"Element","Materialisatie",null,null,"Element","Materialisatie"]
[]
[null,null,null,null,"Fundering",null,null,null,"Fundering",null,null,null,"Fundering"]
[null,null,null,"FU10.t",{"$f":"VLOOKUP(D194,'Input Wonen'!$D$13:$H$151,2,FALSE)","v":"Funderingspaal, ⌀ 300mm; l=15,0m"},{"$f":"VLOOKUP(D194,'Input Wonen'!$D$13:$H$151,3,FALSE)","v":"Schroefpaal; beton, in het werk gestort, C20/25,CEMIII; incl.wapening"},null,"FU10.HNN",{"$f":"IFERROR(VLOOKUP(H194,'Input Wonen'!$J$13:$N$151,COLUMNS('Input Wonen'!J:K),FALSE),\"\")","v":"Funderingspaal, ⌀ 300mm; l=15,0m"},{"$f":"IFERROR(VLOOKUP(H194,'Input Wonen'!$J$13:$N$151,COLUMNS('Input Wonen'!J:L),FALSE),\"\")","v":"Beton met 56% aan secundair aandeel (UMC)"},null,"FU10.E",{"$f":"IFERROR(VLOOKUP(L194,'Input Wonen'!$P$13:$T$151,COLUMNS('Input Wonen'!P:Q),FALSE),\"\")","v":"Funderingspaal, ⌀ 300mm; l=15,0m"},{"$f":"IFERROR(VLOOKUP(L194,'Input Wonen'!$P$13:$T$151,COLUMNS('Input Wonen'!P:R),FALSE),\"\")","v":"Beton met 56% aan secundair aandeel (UMC)"}]
[null,null,null,"FU09.t",{"$f":"VLOOKUP(D195,'Input Wonen'!$D$13:$H$151,2,FALSE)","v":"Funderingsbalken, 400x500mm"},{"$f":"VLOOKUP(D195,'Input Wonen'!$D$13:$H$151,3,FALSE)","v":"In het werk gestort"},null,"FU09.HNN",{"$f":"IFERROR(VLOOKUP(H195,'Input Wonen'!$J$13:$N$151,COLUMNS('Input Wonen'!J:K),FALSE),\"\")","v":"Funderingsbalken, 400x500mm"},{"$f":"IFERROR(VLOOKUP(H195,'Input Wonen'!$J$13:$N$151,COLUMNS('Input Wonen'!J:L),FALSE),\"\")","v":"Beton met 56% aan secundair aandeel (UMC)"},null,"FU09.E",{"$f":"IFERROR(VLOOKUP(L195,'Input Wonen'!$P$13:$T$151,COLUMNS('Input Wonen'!P:Q),FALSE),\"\")","v":"Funderingsbalken, 400x500mm"},{"$f":"IFERROR(VLOOKUP(L195,'Input Wonen'!$P$13:$T$151,COLUMNS('Input Wonen'!P:R),FALSE),\"\")","v":"Beton met 56% aan secundair aandeel (UMC)"}]
[null,null,null,"FU05.t",{"$f":"VLOOKUP(D196,'Input Wonen'!$D$13:$H$151,2,FALSE)","v":"Bodemafsluiting, zand"},{"$f":"VLOOKUP(D196,'Input Wonen'!$D$13:$H$151,3,FALSE)","v":"Zand"},null,"FU05.HNN",{"$f":"IFERROR(VLOOKUP(H196,'Input Wonen'!$J$13:$N$151,COLUMNS('Input Wonen'!J:K),FALSE),\"\")","v":"Bodemafsluiting, 100 zand"},{"$f":"IFERROR(VLOOKUP(H196,'Input Wonen'!$J$13:$N$151,COLUMNS('Input Wonen'!J:L),FALSE),\"\")","v":"Zand"},null,"FU05.E",{"$f":"IFERROR(VLOOKUP(L196,'Input Wonen'!$P$13:$T$151,COLUMNS('Input Wonen'!P:Q),FALSE),\"\")","v":"Bodemafsluiting, 100 zand"},{"$f":"IFERROR(VLOOKUP(L196,'Input Wonen'!$P$13:$T$151,COLUMNS('Input Wonen'!P:R),FALSE),\"\")","v":"Zand"}]
[null,null,null,"FU07.t",{"$f":"VLOOKUP(D197,'Input Wonen'!$D$13:$H$151,2,FALSE)","v":"Opgaand metselwerk"},{"$f":"VLOOKUP(D197,'Input Wonen'!$D$13:$H$151,3,FALSE)","v":"Kalkzandsteen lijmblokken, 100mm"},null,"FU07.HNN",{"$f":"IFERROR(VLOOKUP(H197,'Input Wonen'!$J$13:$N$151,COLUMNS('Input Wonen'!J:K),FALSE),\"\")","v":"Opgaand metselwerk"},{"$f":"IFERROR(VLOOKUP(H197,'Input Wonen'!$J$13:$N$151,COLUMNS('Input Wonen'!J:L),FALSE),\"\")","v":"Kalkzandsteen lijmblokken, 100mm"},null,"FU07.E",{"$f":"IFERROR(VLOOKUP(L197,'Input Wonen'!$P$13:$T$151,COLUMNS('Input Wonen'!P:Q),FALSE),\"\")","v":"Opgaand metselwerk"},{"$f":"IFERROR(VLOOKUP(L197,'Input Wonen'!$P$13:$T$151,COLUMNS('Input Wonen'!P:R),FALSE),\"\")","v":"Kalkzandsteen lijmblokken, 100mm"}]
[null,null,null,null,"Vloeren",null,null,null,"Vloeren",null,null,null,"Vloeren"]
[null,null,null,"VL01.t",{"$f":"VLOOKUP(D199,'Input Wonen'!$D$13:$H$151,2,FALSE)","v":"BG: ribbenvloer, vrijdragend incl. isolatie (Rc=3,7)"},{"$f":"VLOOKUP(D199,'Input Wonen'!$D$13:$H$151,3,FALSE)","v":"Prefab beton"},null,"VL01.HNN",{"$f":"IFERROR(VLOOKUP(H199,'Input Wonen'!$J$13:$N$151,COLUMNS('Input Wonen'!J:K),FALSE),\"\")","v":"BG: kanaalplaatvloer, 200mm incl. isolatie (Rc=3,7)"},{"$f":"IFERROR(VLOOKUP(H199,'Input Wonen'!$J$13:$N$151,COLUMNS('Input Wonen'!J:L),FALSE),\"\")","v":"Kanaalplaat, remontabel (28% recyclaat)"},null,"VL01.E",{"$f":"IFERROR(VLOOKUP(L199,'Input Wonen'!$P$13:$T$151,COLUMNS('Input Wonen'!P:Q),FALSE),\"\")","v":"BG: kanaalplaatvloer, 200mm incl. isolatie (Rc=3,7)"},{"$f":"IFERROR(VLOOKUP(L199,'Input Wonen'!$P$13:$T$151,COLUMNS('Input Wonen'!P:R),FALSE),\"\")","v":"Kanaalplaat, remontabel (28% recyclaat)"}]
[null,null,null,"VL07.t",{"$f":"VLOOKUP(D200,'Input Wonen'!$D$13:$H$151,2,FALSE)","v":"Dekvloeren, 60mm"},{"$f":"VLOOKUP(D200,'Input Wonen'!$D$13:$H$151,3,FALSE)","v":"Zandcement dekvloer"},null,"VL07.HNN",{"$f":"IFERROR(VLOOKUP(H200,'Input Wonen'!$J$13:$N$151,COLUMNS('Input Wonen'!J:K),FALSE),\"\")","v":"Dekvloeren, 60mm"},{"$f":"IFERROR(VLOOKUP(H200,'Input Wonen'!$J$13:$N$151,COLUMNS('Input Wonen'!J:L),FALSE),\"\")","v":"Fermacell honingraatvloer (op houten vloer)"},null,"VL07.E",{"$f":"IFERROR(VLOOKUP(L200,'Input Wonen'!$P$13:$T$151,COLUMNS('Input Wonen'!P:Q),FALSE),\"\")","v":"Dekvloeren, 60mm"},{"$f":"IFERROR(VLOOKUP(L200,'Input Wonen'!$P$13:$T$151,COLUMNS('Input Wonen'!P:R),FALSE),\"\")","v":"Fermacell honingraatvloer (op houten vloer)"}]
[null,null,null,"VL03.t",{"$f":"VLOOKUP(D201,'Input Wonen'!$D$13:$H$151,2,FALSE)","v":"Vloertegelwerk toilet"},{"$f":"VLOOKUP(D201,'Input Wonen'!$D$13:$H$151,3,FALSE)","v":"Keramische tegels, geglazuurd/gelijmd"},null,"VL03.HNN",{"$f":"IFERROR(VLOOKUP(H201,'Input Wonen'!$J$13:$N$151,COLUMNS('Input Wonen'!J:K),FALSE),\"\")","v":"Vloertegelwerk toilet"},{"$f":"IFERROR(VLOOKUP(H201,'Input Wonen'!$J$13:$N$151,COLUMNS('Input Wonen'!J:L),FALSE),\"\")","v":"Mosa C2C vloertegels"},null,"VL03.E",{"$f":"IFERROR(VLOOKUP(L201,'Input Wonen'!$P$13:$T$151,COLUMNS('Input Wonen'!P:Q),FALSE),\"\")","v":"Vloertegelwerk toilet"},{"$f":"IFERROR(VLOOKUP(L201,'Input Wonen'!$P$13:$T$151,COLUMNS('Input Wonen'!P:R),FALSE),\"\")","v":"Mosa C2C vloertegels (losmaakbaar)"}]
[null,null,null,"VL20.t",{"$f":"VLOOKUP(D202,'Input Wonen'!$D$13:$H$151,2,FALSE)","v":"VV: kanaalplaatvloer, 200mm"},{"$f":"VLOOKUP(D202,'Input Wonen'!$D$13:$H$151,3,FALSE)","v":"Kanaalplaatvloer; prefab beton"},null,"VL20.HNN",{"$f":"IFERROR(VLOOKUP(H202,'Input Wonen'!$J$13:$N$151,COLUMNS('Input Wonen'!J:K),FALSE),\"\")","v":"VV: kanaalplaatvloer, 200mm"},{"$f":"IFERROR(VLOOKUP(H202,'Input Wonen'!$J$13:$N$151,COLUMNS('Input Wonen'!J:L),FALSE),\"\")","v":"Kanaalplaatvloer, 200mm (28% recyclaat)"},null,"VL20.E",{"$f":"IFERROR(VLOOKUP(L202,'Input Wonen'!$P$13:$T$151,COLUMNS('Input Wonen'!P:Q),FALSE),\"\")","v":"VV: HSB (grondgeb.) "},{"$f":"IFERROR(VLOOKUP(L202,'Input Wonen'!$P$13:$T$151,COLUMNS('Input Wonen'!P:R),FALSE),\"\")","v":"HSB vloerelement (stijlen+OSB), 18mm; IsoVlas 60mm; gipsplaat (2x)"}]
[null,null,null,"VL07.t",{"$f":"VLOOKUP(D203,'Input Wonen'!$D$13:$H$151,2,FALSE)","v":"Dekvloeren, 60mm"},{"$f":"VLOOKUP(D203,'Input Wonen'!$D$13:$H$151,3,FALSE)","v":"Zandcement dekvloer"},null,"VL07.HNN",{"$f":"IFERROR(VLOOKUP(H203,'Input Wonen'!$J$13:$N$151,COLUMNS('Input Wonen'!J:K),FALSE),\"\")","v":"Dekvloeren, 60mm"},{"$f":"IFERROR(VLOOKUP(H203,'Input Wonen'!$J$13:$N$151,COLUMNS('Input Wonen'!J:L),FALSE),\"\")","v":"Fermacell honingraatvloer (op houten vloer)"},null,"VL07.E",{"$f":"IFERROR(VLOOKUP(L203,'Input Wonen'!$P$13:$T$151,COLUMNS('Input Wonen'!P:Q),FALSE),\"\")","v":"Dekvloeren, 60mm"},{"$f":"IFERROR(VLOOKUP(L203,'Input Wonen'!$P$13:$T$151,COLUMNS('Input Wonen'!P:R),FALSE),\"\")","v":"Fermacell honingraatvloer (op houten vloer)"}]
[null,null,null,"VL04.t",{"$f":"VLOOKUP(D204,'Input Wonen'!$D$13:$H$151,2,FALSE)","v":"Vloertegelwerk badkamer"},{"$f":"VLOOKUP(D204,'Input Wonen'!$D$13:$H$151,3,FALSE)","v":"Keramische tegels, geglazuurd/gelijmd"},null,"VL04.HNN",{"$f":"IFERROR(VLOOKUP(H204,'Input Wonen'!$J$13:$N$151,COLUMNS('Input Wonen'!J:K),FALSE),\"\")","v":"Vloertegelwerk badkamer"},{"$f":"IFERROR(VLOOKUP(H204,'Input Wonen'!$J$13:$N$151,COLUMNS('Input Wonen'!J:L),FALSE),\"\")","v":"Mosa C2C vloertegels"},null,"VL04.E",{"$f":"IFERROR(VLOOKUP(L204,'Input Wonen'!$P$13:$T$151,COLUMNS('Input Wonen'!P:Q),FALSE),\"\")","v":"Vloertegelwerk badkamer"},{"$f":"IFERROR(VLOOKUP(L204,'Input Wonen'!$P$13:$T$151,COLUMNS('Input Wonen'!P:R),FALSE),\"\")","v":"Mosa C2C vloertegels (losmaakbaar)"}]
[null,null,null,null,"Draagconstructie",null,null,null,"Draagconstructie",null,null,null,"Draagconstructie"]
[null,null,null,"DR03.t",{"$f":"VLOOKUP(D206,'Input Wonen'!$D$13:$H$151,2,FALSE)","v":"Zwaar constructiestaal"},{"$f":"VLOOKUP(D206,'Input Wonen'!$D$13:$H$151,3,FALSE)","v":"7.820 kg/m3, incl. conservering"},null,"DR03.HNN",{"$f":"IFERROR(VLOOKUP(H206,'Input Wonen'!$J$13:$N$151,COLUMNS('Input Wonen'!J:K),FALSE),\"\")","v":"Zwaar constructiestaal"},{"$f":"IFERROR(VLOOKUP(H206,'Input Wonen'!$J$13:$N$151,COLUMNS('Input Wonen'!J:L),FALSE),\"\")","v":"7.820 kg/m3, incl. conservering"},null,"DR03.E",{"$f":"IFERROR(VLOOKUP(L206,'Input Wonen'!$P$13:$T$151,COLUMNS('Input Wonen'!P:Q),FALSE),\"\")","v":"Zwaar constructiestaal"},{"$f":"IFERROR(VLOOKUP(L206,'Input Wonen'!$P$13:$T$151,COLUMNS('Input Wonen'!P:R),FALSE),\"\")","v":"7.820 kg/m3, incl. conservering"}]
[null,null,null,null,"Gevel",null,null,null,"Gevel",null,null,null,"Gevel"]
[null,null,null,"GE50.t",{"$f":"VLOOKUP(D208,'Input Wonen'!$D$13:$H$151,2,FALSE)","v":"Gevelkozijnen; incl. HR++ beglazing"},{"$f":"VLOOKUP(D208,'Input Wonen'!$D$13:$H$151,3,FALSE)","v":"Az. loofhout (Meranti), geschilderd"},null,"GE50.HNN",{"$f":"IFERROR(VLOOKUP(H208,'Input Wonen'!$J$13:$N$151,COLUMNS('Input Wonen'!J:K),FALSE),\"\")","v":"Gevelkozijnen; incl. HR++ beglazing"},{"$f":"IFERROR(VLOOKUP(H208,'Input Wonen'!$J$13:$N$151,COLUMNS('Input Wonen'!J:L),FALSE),\"\")","v":"Europees naaldhout, geschilderd"},null,"GE50.E",{"$f":"IFERROR(VLOOKUP(L208,'Input Wonen'!$P$13:$T$151,COLUMNS('Input Wonen'!P:Q),FALSE),\"\")","v":"Gevelkozijnen; incl. Isomax beglazing"},{"$f":"IFERROR(VLOOKUP(L208,'Input Wonen'!$P$13:$T$151,COLUMNS('Input Wonen'!P:R),FALSE),\"\")","v":"Europees naaldhout, geschilderd"}]
[null,null,null,"GE04.t",{"$f":"VLOOKUP(D209,'Input Wonen'!$D$13:$H$151,2,FALSE)","v":"Vensterbanken"},{"$f":"VLOOKUP(D209,'Input Wonen'!$D$13:$H$151,3,FALSE)","v":"Composietsteen "},null,"GE04.HNN",{"$f":"IFERROR(VLOOKUP(H209,'Input Wonen'!$J$13:$N$151,COLUMNS('Input Wonen'!J:K),FALSE),\"\")","v":"Vensterbanken"},{"$f":"IFERROR(VLOOKUP(H209,'Input Wonen'!$J$13:$N$151,COLUMNS('Input Wonen'!J:L),FALSE),\"\")","v":"Composietsteen"},null,"GE04.E",{"$f":"IFERROR(VLOOKUP(L209,'Input Wonen'!$P$13:$T$151,COLUMNS('Input Wonen'!P:Q),FALSE),\"\")","v":"Vensterbanken"},{"$f":"IFERROR(VLOOKUP(L209,'Input Wonen'!$P$13:$T$151,COLUMNS('Input Wonen'!P:R),FALSE),\"\")","v":"Composietsteen"}]
[null,null,null,"GE05.t",{"$f":"VLOOKUP(D210,'Input Wonen'!$D$13:$H$151,2,FALSE)","v":"Waterslagen"},{"$f":"VLOOKUP(D210,'Input Wonen'!$D$13:$H$151,3,FALSE)","v":"Prefab beton"},null,"GE05.HNN",{"$f":"IFERROR(VLOOKUP(H210,'Input Wonen'!$J$13:$N$151,COLUMNS('Input Wonen'!J:K),FALSE),\"\")","v":"Waterslagen"},{"$f":"IFERROR(VLOOKUP(H210,'Input Wonen'!$J$13:$N$151,COLUMNS('Input Wonen'!J:L),FALSE),\"\")","v":"Prefab beton"},null,"GE05.E",{"$f":"IFERROR(VLOOKUP(L210,'Input Wonen'!$P$13:$T$151,COLUMNS('Input Wonen'!P:Q),FALSE),\"\")","v":"Waterslagen"},{"$f":"IFERROR(VLOOKUP(L210,'Input Wonen'!$P$13:$T$151,COLUMNS('Input Wonen'!P:R),FALSE),\"\")","v":"Prefab beton"}]
[null,null,null,"GE22.t",{"$f":"VLOOKUP(D211,'Input Wonen'!$D$13:$H$151,2,FALSE)","v":"Lateien"},{"$f":"VLOOKUP(D211,'Input Wonen'!$D$13:$H$151,3,FALSE)","v":"Prefab beton"},null,"GE22.HNN",{"$f":"IFERROR(VLOOKUP(H211,'Input Wonen'!$J$13:$N$151,COLUMNS('Input Wonen'!J:K),FALSE),\"\")","v":"Lateien"},{"$f":"IFERROR(VLOOKUP(H211,'Input Wonen'!$J$13:$N$151,COLUMNS('Input Wonen'!J:L),FALSE),\"\")","v":"Prefab beton"},null,"GE22.E",{"$f":"IFERROR(VLOOKUP(L211,'Input Wonen'!$P$13:$T$151,COLUMNS('Input Wonen'!P:Q),FALSE),\"\")","v":"Lateien"},{"$f":"IFERROR(VLOOKUP(L211,'Input Wonen'!$P$13:$T$151,COLUMNS('Input Wonen'!P:R),FALSE),\"\")","v":"Prefab beton"}]
[null,null,null,"GE08.t",{"$f":"VLOOKUP(D212,'Input Wonen'!$D$13:$H$151,2,FALSE)","v":"Buitendeur; incl. glasopening 0,85m2"},{"$f":"VLOOKUP(D212,'Input Wonen'!$D$13:$H$151,3,FALSE)","v":"Onverduurzaamd hout, geverfd"},null,"GE08.HNN",{"$f":"IFERROR(VLOOKUP(H212,'Input Wonen'!$J$13:$N$151,COLUMNS('Input Wonen'!J:K),FALSE),\"\")","v":"Buitendeur; incl. glasopening 0,85m2"},{"$f":"IFERROR(VLOOKUP(H212,'Input Wonen'!$J$13:$N$151,COLUMNS('Input Wonen'!J:L),FALSE),\"\")","v":"Onverduurzaamd hout, geverfd"},null,"GE08.E",{"$f":"IFERROR(VLOOKUP(L212,'Input Wonen'!$P$13:$T$151,COLUMNS('Input Wonen'!P:Q),FALSE),\"\")","v":"Buitendeur; incl. glasopening 0,85m2"},{"$f":"IFERROR(VLOOKUP(L212,'Input Wonen'!$P$13:$T$151,COLUMNS('Input Wonen'!P:R),FALSE),\"\")","v":"Onverduurzaamd hout, geverfd"}]
[null,null,null,"GE09.t",{"$f":"VLOOKUP(D213,'Input Wonen'!$D$13:$H$151,2,FALSE)","v":"Buitenspouwblad, 100mm"},{"$f":"VLOOKUP(D213,'Input Wonen'!$D$13:$H$151,3,FALSE)","v":"Baksteenmetselwerk"},null,"GE09.HNN",{"$f":"IFERROR(VLOOKUP(H213,'Input Wonen'!$J$13:$N$151,COLUMNS('Input Wonen'!J:K),FALSE),\"\")","v":"Buitenspouwblad"},{"$f":"IFERROR(VLOOKUP(H213,'Input Wonen'!$J$13:$N$151,COLUMNS('Input Wonen'!J:L),FALSE),\"\")","v":"Ecobrick Wienerberger"},null,"GE09.E",{"$f":"IFERROR(VLOOKUP(L213,'Input Wonen'!$P$13:$T$151,COLUMNS('Input Wonen'!P:Q),FALSE),\"\")","v":"Buitenspouwblad"},{"$f":"IFERROR(VLOOKUP(L213,'Input Wonen'!$P$13:$T$151,COLUMNS('Input Wonen'!P:R),FALSE),\"\")","v":"Houten gevelbekleding; Meranti delen"}]
[null,null,null,"GE26.t",{"$f":"VLOOKUP(D214,'Input Wonen'!$D$13:$H$151,2,FALSE)","v":"Isolatielagen, Rc=4,7"},{"$f":"VLOOKUP(D214,'Input Wonen'!$D$13:$H$151,3,FALSE)","v":"Glaswolplaten, MWA 2012"},null,"GE26.HNN",{"$f":"IFERROR(VLOOKUP(H214,'Input Wonen'!$J$13:$N$151,COLUMNS('Input Wonen'!J:K),FALSE),\"\")","v":"Isolatielagen, Rc=4,7"},{"$f":"IFERROR(VLOOKUP(H214,'Input Wonen'!$J$13:$N$151,COLUMNS('Input Wonen'!J:L),FALSE),\"\")","v":"Isovlas plaat, PN160mm"},null,"GE10.E",{"$f":"IFERROR(VLOOKUP(L214,'Input Wonen'!$P$13:$T$151,COLUMNS('Input Wonen'!P:Q),FALSE),\"\")","v":"Isolatielagen, Rc=4,7"},{"$f":"IFERROR(VLOOKUP(L214,'Input Wonen'!$P$13:$T$151,COLUMNS('Input Wonen'!P:R),FALSE),\"\")","v":"Isovlas plaat, PN160mm"}]
[null,null,null,"GE11.t",{"$f":"VLOOKUP(D215,'Input Wonen'!$D$13:$H$151,2,FALSE)","v":"Binnenspouwblad, 100mm (bruto)"},{"$f":"VLOOKUP(D215,'Input Wonen'!$D$13:$H$151,3,FALSE)","v":"Prefab beton"},null,"GE11.HNN",{"$f":"IFERROR(VLOOKUP(H215,'Input Wonen'!$J$13:$N$151,COLUMNS('Input Wonen'!J:K),FALSE),\"\")","v":"Binnenspouwblad, 100mm (bruto)"},{"$f":"IFERROR(VLOOKUP(H215,'Input Wonen'!$J$13:$N$151,COLUMNS('Input Wonen'!J:L),FALSE),\"\")","v":"Prefab beton (UMC)"},null,"GE11.E",{"$f":"IFERROR(VLOOKUP(L215,'Input Wonen'!$P$13:$T$151,COLUMNS('Input Wonen'!P:Q),FALSE),\"\")","v":"Binnenspouwblad, HSB (bruto)"},{"$f":"IFERROR(VLOOKUP(L215,'Input Wonen'!$P$13:$T$151,COLUMNS('Input Wonen'!P:R),FALSE),\"\")","v":"HSB element incl. Isovlas isolatie"}]
[null,null,null,null,"Daken",null,null,null,"Daken",null,null,null,"Daken"]
[null,null,null,"DA17.t",{"$f":"VLOOKUP(D217,'Input Wonen'!$D$13:$H$151,2,FALSE)","v":"Dakconstructie, plat dak; kanaalplaat"},{"$f":"VLOOKUP(D217,'Input Wonen'!$D$13:$H$151,3,FALSE)","v":"Kanaalplaatvloer, 200mm; prefab beton"},null,"DA17.HNN",{"$f":"IFERROR(VLOOKUP(H217,'Input Wonen'!$J$13:$N$151,COLUMNS('Input Wonen'!J:K),FALSE),\"\")","v":"Dakconstructie, plat dak; kanaalplaat"},{"$f":"IFERROR(VLOOKUP(H217,'Input Wonen'!$J$13:$N$151,COLUMNS('Input Wonen'!J:L),FALSE),\"\")","v":"Kanaalplaatvloer, 200mm; prefab beton"},null,"DA17.E",{"$f":"IFERROR(VLOOKUP(L217,'Input Wonen'!$P$13:$T$151,COLUMNS('Input Wonen'!P:Q),FALSE),\"\")","v":"Dakconstructie, plat dak"},{"$f":"IFERROR(VLOOKUP(L217,'Input Wonen'!$P$13:$T$151,COLUMNS('Input Wonen'!P:R),FALSE),\"\")","v":"HSB vloerelement (stijlen+OSB); IsoVlas 60mm; incl. gipskartonplafond"}]
[null,null,null,"DA16.t",{"$f":"VLOOKUP(D218,'Input Wonen'!$D$13:$H$151,2,FALSE)","v":"Isolatielagen; plat dak; Rc=6,3"},{"$f":"VLOOKUP(D218,'Input Wonen'!$D$13:$H$151,3,FALSE)","v":"EPS"},null,"DA16.HNN",{"$f":"IFERROR(VLOOKUP(H218,'Input Wonen'!$J$13:$N$151,COLUMNS('Input Wonen'!J:K),FALSE),\"\")","v":"Isolatielagen; plat dak; Rc=6,3"},{"$f":"IFERROR(VLOOKUP(H218,'Input Wonen'!$J$13:$N$151,COLUMNS('Input Wonen'!J:L),FALSE),\"\")","v":"Houtvezel vlakke isolatieplaten"},null,"DA16.E",{"$f":"IFERROR(VLOOKUP(L218,'Input Wonen'!$P$13:$T$151,COLUMNS('Input Wonen'!P:Q),FALSE),\"\")","v":"Isolatielagen; plat dak; Rc=6,3"},{"$f":"IFERROR(VLOOKUP(L218,'Input Wonen'!$P$13:$T$151,COLUMNS('Input Wonen'!P:R),FALSE),\"\")","v":"Houtvezel vlakke isolatieplaten"}]
[null,null,null,"DA09.t",{"$f":"VLOOKUP(D219,'Input Wonen'!$D$13:$H$151,2,FALSE)","v":"Dakbedekking"},{"$f":"VLOOKUP(D219,'Input Wonen'!$D$13:$H$151,3,FALSE)","v":"Bitumen, gemod. eenlaags 4,3mm"},null,"DA09.HNN",{"$f":"IFERROR(VLOOKUP(H219,'Input Wonen'!$J$13:$N$151,COLUMNS('Input Wonen'!J:K),FALSE),\"\")","v":"Dakbedekking"},{"$f":"IFERROR(VLOOKUP(H219,'Input Wonen'!$J$13:$N$151,COLUMNS('Input Wonen'!J:L),FALSE),\"\")","v":"EPDM losmaakbare dakbedekking"},null,"DA09.E",{"$f":"IFERROR(VLOOKUP(L219,'Input Wonen'!$P$13:$T$151,COLUMNS('Input Wonen'!P:Q),FALSE),\"\")","v":"Dakbedekking"},{"$f":"IFERROR(VLOOKUP(L219,'Input Wonen'!$P$13:$T$151,COLUMNS('Input Wonen'!P:R),FALSE),\"\")","v":"EPDM losmaakbare dakbedekking"}]
[null,null,null,"DA04.t",{"$f":"VLOOKUP(D220,'Input Wonen'!$D$13:$H$151,2,FALSE)","v":"Dakafwerking"},{"$f":"VLOOKUP(D220,'Input Wonen'!$D$13:$H$151,3,FALSE)","v":"Daktrim; aluminium gemoffeld"},null,"DA04.HNN",{"$f":"IFERROR(VLOOKUP(H220,'Input Wonen'!$J$13:$N$151,COLUMNS('Input Wonen'!J:K),FALSE),\"\")","v":"Dakafwerking"},{"$f":"IFERROR(VLOOKUP(H220,'Input Wonen'!$J$13:$N$151,COLUMNS('Input Wonen'!J:L),FALSE),\"\")","v":"Daktrim; aluminium gemoffeld"},null,"DA04.E",{"$f":"IFERROR(VLOOKUP(L220,'Input Wonen'!$P$13:$T$151,COLUMNS('Input Wonen'!P:Q),FALSE),\"\")","v":"Dakafwerking"},{"$f":"IFERROR(VLOOKUP(L220,'Input Wonen'!$P$13:$T$151,COLUMNS('Input Wonen'!P:R),FALSE),\"\")","v":"Daktrim; aluminium gemoffeld"}]
[null,null,null,"DA14.t",{"$f":"VLOOKUP(D221,'Input Wonen'!$D$13:$H$151,2,FALSE)","v":"Waterkeringen"},{"$f":"VLOOKUP(D221,'Input Wonen'!$D$13:$H$151,3,FALSE)","v":"Polyetheen; folie"},null,"DA14.HNN",{"$f":"IFERROR(VLOOKUP(H221,'Input Wonen'!$J$13:$N$151,COLUMNS('Input Wonen'!J:K),FALSE),\"\")","v":"Waterkeringen"},{"$f":"IFERROR(VLOOKUP(H221,'Input Wonen'!$J$13:$N$151,COLUMNS('Input Wonen'!J:L),FALSE),\"\")","v":"Polyetheen; folie"},null,"DA14.E",{"$f":"IFERROR(VLOOKUP(L221,'Input Wonen'!$P$13:$T$151,COLUMNS('Input Wonen'!P:Q),FALSE),\"\")","v":"Waterkeringen"},{"$f":"IFERROR(VLOOKUP(L221,'Input Wonen'!$P$13:$T$151,COLUMNS('Input Wonen'!P:R),FALSE),\"\")","v":"Polyetheen; folie"}]
[null,null,null,null,"Binnenwanden",null,null,null,"Binnenwanden",null,null,null,"Binnenwanden"]
[null,null,null,"BI02.t",{"$f":"VLOOKUP(D223,'Input Wonen'!$D$13:$H$151,2,FALSE)","v":"Woningscheidende wanden, 100mm;"},{"$f":"VLOOKUP(D223,'Input Wonen'!$D$13:$H$151,3,FALSE)","v":"Prefab beton"},null,"BI02.HNN",{"$f":"IFERROR(VLOOKUP(H223,'Input Wonen'!$J$13:$N$151,COLUMNS('Input Wonen'!J:K),FALSE),\"\")","v":"Woningscheidende wanden, 100mm;"},{"$f":"IFERROR(VLOOKUP(H223,'Input Wonen'!$J$13:$N$151,COLUMNS('Input Wonen'!J:L),FALSE),\"\")","v":"Prefab beton"},null,"BI02.E",{"$f":"IFERROR(VLOOKUP(L223,'Input Wonen'!$P$13:$T$151,COLUMNS('Input Wonen'!P:Q),FALSE),\"\")","v":"Woningscheidende wanden, HSB"},{"$f":"IFERROR(VLOOKUP(L223,'Input Wonen'!$P$13:$T$151,COLUMNS('Input Wonen'!P:R),FALSE),\"\")","v":"HSB binnenwand element met vlasisolatie"}]
[null,null,null,"BI04.t",{"$f":"VLOOKUP(D224,'Input Wonen'!$D$13:$H$151,2,FALSE)","v":"Wandtegelwerk badkamer, toilet en keuken"},{"$f":"VLOOKUP(D224,'Input Wonen'!$D$13:$H$151,3,FALSE)","v":"Keramische tegels; geglazuurd/gelijmd"},null,"BI04.HNN",{"$f":"IFERROR(VLOOKUP(H224,'Input Wonen'!$J$13:$N$151,COLUMNS('Input Wonen'!J:K),FALSE),\"\")","v":"Wandtegelwerk badkamer, toilet en keuken"},{"$f":"IFERROR(VLOOKUP(H224,'Input Wonen'!$J$13:$N$151,COLUMNS('Input Wonen'!J:L),FALSE),\"\")","v":"Mosa C2C wandtegels"},null,"BI04.E",{"$f":"IFERROR(VLOOKUP(L224,'Input Wonen'!$P$13:$T$151,COLUMNS('Input Wonen'!P:Q),FALSE),\"\")","v":"Wandtegelwerk badkamer, toilet en keuken"},{"$f":"IFERROR(VLOOKUP(L224,'Input Wonen'!$P$13:$T$151,COLUMNS('Input Wonen'!P:R),FALSE),\"\")","v":"Gerecycled PET i.c.m. Quartz"}]
[null,null,null,"BI05.t",{"$f":"VLOOKUP(D225,'Input Wonen'!$D$13:$H$151,2,FALSE)","v":"Binnenwanden, 70mm"},{"$f":"VLOOKUP(D225,'Input Wonen'!$D$13:$H$151,3,FALSE)","v":"Gipsblokken, normale dichtheid"},null,"BI05.HNN",{"$f":"IFERROR(VLOOKUP(H225,'Input Wonen'!$J$13:$N$151,COLUMNS('Input Wonen'!J:K),FALSE),\"\")","v":"Binnenwanden, 70mm"},{"$f":"IFERROR(VLOOKUP(H225,'Input Wonen'!$J$13:$N$151,COLUMNS('Input Wonen'!J:L),FALSE),\"\")","v":"Faay volpaneel"},null,"BI05.E",{"$f":"IFERROR(VLOOKUP(L225,'Input Wonen'!$P$13:$T$151,COLUMNS('Input Wonen'!P:Q),FALSE),\"\")","v":"Binnenwanden, 70mm"},{"$f":"IFERROR(VLOOKUP(L225,'Input Wonen'!$P$13:$T$151,COLUMNS('Input Wonen'!P:R),FALSE),\"\")","v":"Faay volpaneel"}]
[null,null,null,"BI11.t",{"$f":"VLOOKUP(D226,'Input Wonen'!$D$13:$H$151,2,FALSE)","v":"Binnenkozijnen"},{"$f":"VLOOKUP(D226,'Input Wonen'!$D$13:$H$151,3,FALSE)","v":"Staal; verzinkt+gemoffeld"},null,"BI11.HNN",{"$f":"IFERROR(VLOOKUP(H226,'Input Wonen'!$J$13:$N$151,COLUMNS('Input Wonen'!J:K),FALSE),\"\")","v":"Binnenkozijnen"},{"$f":"IFERROR(VLOOKUP(H226,'Input Wonen'!$J$13:$N$151,COLUMNS('Input Wonen'!J:L),FALSE),\"\")","v":"Europees naaldhout, geschilderd"},null,"BI11.E",{"$f":"IFERROR(VLOOKUP(L226,'Input Wonen'!$P$13:$T$151,COLUMNS('Input Wonen'!P:Q),FALSE),\"\")","v":"Binnenkozijnen"},{"$f":"IFERROR(VLOOKUP(L226,'Input Wonen'!$P$13:$T$151,COLUMNS('Input Wonen'!P:R),FALSE),\"\")","v":"Europees naaldhout, geschilderd"}]
[null,null,null,"BI08.t",{"$f":"VLOOKUP(D227,'Input Wonen'!$D$13:$H$151,2,FALSE)","v":"Binnendeuren"},{"$f":"VLOOKUP(D227,'Input Wonen'!$D$13:$H$151,3,FALSE)","v":"Honingraat; vlakke binnendeur"},null,"BI08.HNN",{"$f":"IFERROR(VLOOKUP(H227,'Input Wonen'!$J$13:$N$151,COLUMNS('Input Wonen'!J:K),FALSE),\"\")","v":"Binnendeuren"},{"$f":"IFERROR(VLOOKUP(H227,'Input Wonen'!$J$13:$N$151,COLUMNS('Input Wonen'!J:L),FALSE),\"\")","v":"Honingraat; vlakke binnendeur"},null,"BI08.E",{"$f":"IFERROR(VLOOKUP(L227,'Input Wonen'!$P$13:$T$151,COLUMNS('Input Wonen'!P:Q),FALSE),\"\")","v":"Binnendeuren"},{"$f":"IFERROR(VLOOKUP(L227,'Input Wonen'!$P$13:$T$151,COLUMNS('Input Wonen'!P:R),FALSE),\"\")","v":"Honingraat; vlakke binnendeur"}]
[null,null,null,"BI10.t",{"$f":"VLOOKUP(D228,'Input Wonen'!$D$13:$H$151,2,FALSE)","v":"Binnendorpels"},{"$f":"VLOOKUP(D228,'Input Wonen'!$D$13:$H$151,3,FALSE)","v":"Gegoten composietsteen"},null,"BI10.HNN",{"$f":"IFERROR(VLOOKUP(H228,'Input Wonen'!$J$13:$N$151,COLUMNS('Input Wonen'!J:K),FALSE),\"\")","v":"Binnendorpels"},{"$f":"IFERROR(VLOOKUP(H228,'Input Wonen'!$J$13:$N$151,COLUMNS('Input Wonen'!J:L),FALSE),\"\")","v":"Kunststeen"},null,"BI10.E",{"$f":"IFERROR(VLOOKUP(L228,'Input Wonen'!$P$13:$T$151,COLUMNS('Input Wonen'!P:Q),FALSE),\"\")","v":"Binnendorpels"},{"$f":"IFERROR(VLOOKUP(L228,'Input Wonen'!$P$13:$T$151,COLUMNS('Input Wonen'!P:R),FALSE),\"\")","v":"Kunststeen"}]
[null,null,null,null,"Klimaatinstallaties",null,null,null,"Klimaatinstallaties",null,null,null,"Klimaatinstallaties"]
[null,null,null,"KL06.t",{"$f":"VLOOKUP(D230,'Input Wonen'!$D$13:$H$151,2,FALSE)","v":"Waterleidingen, verwarmd tapwater"},{"$f":"VLOOKUP(D230,'Input Wonen'!$D$13:$H$151,3,FALSE)","v":"PVC, incl. mantelbuis 15mm; W-bouw"},null,"KL06.HNN",{"$f":"IFERROR(VLOOKUP(H230,'Input Wonen'!$J$13:$N$151,COLUMNS('Input Wonen'!J:K),FALSE),\"\")","v":"Waterleidingen, verwarmd tapwater"},{"$f":"IFERROR(VLOOKUP(H230,'Input Wonen'!$J$13:$N$151,COLUMNS('Input Wonen'!J:L),FALSE),\"\")","v":"PVC, incl. mantelbuis 15mm; W-bouw"},null,"KL06.E",{"$f":"IFERROR(VLOOKUP(L230,'Input Wonen'!$P$13:$T$151,COLUMNS('Input Wonen'!P:Q),FALSE),\"\")","v":"Waterleidingen, verwarmd tapwater"},{"$f":"IFERROR(VLOOKUP(L230,'Input Wonen'!$P$13:$T$151,COLUMNS('Input Wonen'!P:R),FALSE),\"\")","v":"PVC, incl. mantelbuis 15mm; W-bouw"}]
[null,null,null,"KL07.t",{"$f":"VLOOKUP(D231,'Input Wonen'!$D$13:$H$151,2,FALSE)","v":"Warmtapwaterinstallatie"},{"$f":"VLOOKUP(D231,'Input Wonen'!$D$13:$H$151,3,FALSE)","v":"Elektrische boiler; CW:4-6 120 liter"},null,"KL07.HNN",{"$f":"IFERROR(VLOOKUP(H231,'Input Wonen'!$J$13:$N$151,COLUMNS('Input Wonen'!J:K),FALSE),\"\")","v":"Warmtapwaterinstallatie"},{"$f":"IFERROR(VLOOKUP(H231,'Input Wonen'!$J$13:$N$151,COLUMNS('Input Wonen'!J:L),FALSE),\"\")","v":"Elektrische boiler; CW:4-6 120 liter"},null,"KL07.E",{"$f":"IFERROR(VLOOKUP(L231,'Input Wonen'!$P$13:$T$151,COLUMNS('Input Wonen'!P:Q),FALSE),\"\")","v":"Warmtapwaterinstallatie"},{"$f":"IFERROR(VLOOKUP(L231,'Input Wonen'!$P$13:$T$151,COLUMNS('Input Wonen'!P:R),FALSE),\"\")","v":"Elektrische boiler; CW:4-6 120 liter"}]
[null,null,null,"KL03.t",{"$f":"VLOOKUP(D232,'Input Wonen'!$D$13:$H$151,2,FALSE)","v":"Warmteafgiftesysteem"},{"$f":"VLOOKUP(D232,'Input Wonen'!$D$13:$H$151,3,FALSE)","v":"Vloerverwarming 95 W/m2"},null,"KL03.HNN",{"$f":"IFERROR(VLOOKUP(H232,'Input Wonen'!$J$13:$N$151,COLUMNS('Input Wonen'!J:K),FALSE),\"\")","v":"Warmteafgiftesysteem"},{"$f":"IFERROR(VLOOKUP(H232,'Input Wonen'!$J$13:$N$151,COLUMNS('Input Wonen'!J:L),FALSE),\"\")","v":"Vloerverwarming 95 W/m2"},null,"KL03.E",{"$f":"IFERROR(VLOOKUP(L232,'Input Wonen'!$P$13:$T$151,COLUMNS('Input Wonen'!P:Q),FALSE),\"\")","v":"Warmteafgiftesysteem"},{"$f":"IFERROR(VLOOKUP(L232,'Input Wonen'!$P$13:$T$151,COLUMNS('Input Wonen'!P:R),FALSE),\"\")","v":"Vloerverwarming 95 W/m2 "}]
[null,null,null,"KL08.t",{"$f":"VLOOKUP(D233,'Input Wonen'!$D$13:$H$151,2,FALSE)","v":"Warmteopwekkinginstallatie"},{"$f":"VLOOKUP(D233,'Input Wonen'!$D$13:$H$151,3,FALSE)","v":"Warmtepomp luchtwater 10kW"},null,"KL08.HNN",{"$f":"IFERROR(VLOOKUP(H233,'Input Wonen'!$J$13:$N$151,COLUMNS('Input Wonen'!J:K),FALSE),\"\")","v":"Warmteopwekkinginstallatie"},{"$f":"IFERROR(VLOOKUP(H233,'Input Wonen'!$J$13:$N$151,COLUMNS('Input Wonen'!J:L),FALSE),\"\")","v":"Warmtepomp luchtwater 10kW"},null,"KL08.E",{"$f":"IFERROR(VLOOKUP(L233,'Input Wonen'!$P$13:$T$151,COLUMNS('Input Wonen'!P:Q),FALSE),\"\")","v":"Warmteopwekkinginstallatie"},{"$f":"IFERROR(VLOOKUP(L233,'Input Wonen'!$P$13:$T$151,COLUMNS('Input Wonen'!P:R),FALSE),\"\")","v":"Warmtepomp luchtwater 10kW"}]
[null,null,null,"KL02.t",{"$f":"VLOOKUP(D234,'Input Wonen'!$D$13:$H$151,2,FALSE)","v":"Warmtedistributiesysteem"},{"$f":"VLOOKUP(D234,'Input Wonen'!$D$13:$H$151,3,FALSE)","v":"CV-leidingen incl. koppelingen + verdeling"},null,"KL02.HNN",{"$f":"IFERROR(VLOOKUP(H234,'Input Wonen'!$J$13:$N$151,COLUMNS('Input Wonen'!J:K),FALSE),\"\")","v":"Warmtedistributiesysteem"},{"$f":"IFERROR(VLOOKUP(H234,'Input Wonen'!$J$13:$N$151,COLUMNS('Input Wonen'!J:L),FALSE),\"\")","v":"CV-leidingen incl. koppelingen + verdeling"},null,"KL02.E",{"$f":"IFERROR(VLOOKUP(L234,'Input Wonen'!$P$13:$T$151,COLUMNS('Input Wonen'!P:Q),FALSE),\"\")","v":"Warmtedistributiesysteem"},{"$f":"IFERROR(VLOOKUP(L234,'Input Wonen'!$P$13:$T$151,COLUMNS('Input Wonen'!P:R),FALSE),\"\")","v":"CV-leidingen incl. koppelingen + verdeling"}]
[null,null,null,"KL05.t",{"$f":"VLOOKUP(D235,'Input Wonen'!$D$13:$H$151,2,FALSE)","v":"Luchtdistributiesysteem"},{"$f":"VLOOKUP(D235,'Input Wonen'!$D$13:$H$151,3,FALSE)","v":"VLA ventilatiesysteem, type D met centrale wtw; W-bouw, individueel"},null,"KL05.HNN",{"$f":"IFERROR(VLOOKUP(H235,'Input Wonen'!$J$13:$N$151,COLUMNS('Input Wonen'!J:K),FALSE),\"\")","v":"Luchtdistributiesysteem"},{"$f":"IFERROR(VLOOKUP(H235,'Input Wonen'!$J$13:$N$151,COLUMNS('Input Wonen'!J:L),FALSE),\"\")","v":"VLA ventilatiesysteem, type D met centrale wtw; W-bouw, individueel"},null,"KL05.E",{"$f":"IFERROR(VLOOKUP(L235,'Input Wonen'!$P$13:$T$151,COLUMNS('Input Wonen'!P:Q),FALSE),\"\")","v":"Luchtdistributiesysteem"},{"$f":"IFERROR(VLOOKUP(L235,'Input Wonen'!$P$13:$T$151,COLUMNS('Input Wonen'!P:R),FALSE),\"\")","v":"VLA ventilatiesysteem, type D met centrale wtw; W-bouw, individueel"}]
[null,null,null,null,"Elektrische installaties",null,null,null,"Elektrische installaties",null,null,null,"Elektrische installaties"]
[null,null,null,"EL01.t",{"$f":"VLOOKUP(D237,'Input Wonen'!$D$13:$H$151,2,FALSE)","v":"Elektriciteitsleidingen"},{"$f":"VLOOKUP(D237,'Input Wonen'!$D$13:$H$151,3,FALSE)","v":"Geïsoleerde installatiedraad + mantelbuis"},null,"EL01.HNN",{"$f":"IFERROR(VLOOKUP(H237,'Input Wonen'!$J$13:$N$151,COLUMNS('Input Wonen'!J:K),FALSE),\"\")","v":"Elektriciteitsleidingen"},{"$f":"IFERROR(VLOOKUP(H237,'Input Wonen'!$J$13:$N$151,COLUMNS('Input Wonen'!J:L),FALSE),\"\")","v":"Geïsoleerde installatiedraad + mantelbuis"},null,"EL01.E",{"$f":"IFERROR(VLOOKUP(L237,'Input Wonen'!$P$13:$T$151,COLUMNS('Input Wonen'!P:Q),FALSE),\"\")","v":"Elektriciteitsleidingen"},{"$f":"IFERROR(VLOOKUP(L237,'Input Wonen'!$P$13:$T$151,COLUMNS('Input Wonen'!P:R),FALSE),\"\")","v":"Geïsoleerde installatiedraad + mantelbuis"}]
[null,null,null,"EL03.t",{"$f":"VLOOKUP(D238,'Input Wonen'!$D$13:$H$151,2,FALSE)","v":"Pv-panelen, plat dak"},{"$f":"VLOOKUP(D238,'Input Wonen'!$D$13:$H$151,3,FALSE)","v":"Mono-Si; incl. inverter+kabels"},null,"EL03.HNN",{"$f":"IFERROR(VLOOKUP(H238,'Input Wonen'!$J$13:$N$151,COLUMNS('Input Wonen'!J:K),FALSE),\"\")","v":"Pv-panelen, plat dak"},{"$f":"IFERROR(VLOOKUP(H238,'Input Wonen'!$J$13:$N$151,COLUMNS('Input Wonen'!J:L),FALSE),\"\")","v":"Exasun Xglass"},null,"EL03.E",{"$f":"IFERROR(VLOOKUP(L238,'Input Wonen'!$P$13:$T$151,COLUMNS('Input Wonen'!P:Q),FALSE),\"\")","v":"Pv-panelen, plat dak"},{"$f":"IFERROR(VLOOKUP(L238,'Input Wonen'!$P$13:$T$151,COLUMNS('Input Wonen'!P:R),FALSE),\"\")","v":"Exasun Xglass"}]
[null,null,null,null,"Toe- en afvoeren",null,null,null,"Toe- en afvoeren",null,null,null,"Toe- en afvoeren"]
[null,null,null,"TO01.t",{"$f":"VLOOKUP(D240,'Input Wonen'!$D$13:$H$151,2,FALSE)","v":"Waterleidingen"},{"$f":"VLOOKUP(D240,'Input Wonen'!$D$13:$H$151,3,FALSE)","v":"Polyetheen; leiding+mantelbuis"},null,"TO01.HNN",{"$f":"IFERROR(VLOOKUP(H240,'Input Wonen'!$J$13:$N$151,COLUMNS('Input Wonen'!J:K),FALSE),\"\")","v":"Waterleidingen"},{"$f":"IFERROR(VLOOKUP(H240,'Input Wonen'!$J$13:$N$151,COLUMNS('Input Wonen'!J:L),FALSE),\"\")","v":"Polyetheen"},null,"TO01.E",{"$f":"IFERROR(VLOOKUP(L240,'Input Wonen'!$P$13:$T$151,COLUMNS('Input Wonen'!P:Q),FALSE),\"\")","v":"Waterleidingen"},{"$f":"IFERROR(VLOOKUP(L240,'Input Wonen'!$P$13:$T$151,COLUMNS('Input Wonen'!P:R),FALSE),\"\")","v":"Polyetheen"}]
[null,null,null,"TO02.t",{"$f":"VLOOKUP(D241,'Input Wonen'!$D$13:$H$151,2,FALSE)","v":"Buitenriolering kavel"},{"$f":"VLOOKUP(D241,'Input Wonen'!$D$13:$H$151,3,FALSE)","v":"PVC"},null,"TO02.HNN",{"$f":"IFERROR(VLOOKUP(H241,'Input Wonen'!$J$13:$N$151,COLUMNS('Input Wonen'!J:K),FALSE),\"\")","v":"Buitenriolering"},{"$f":"IFERROR(VLOOKUP(H241,'Input Wonen'!$J$13:$N$151,COLUMNS('Input Wonen'!J:L),FALSE),\"\")","v":"Gerecycled PVC (Pipelife)"},null,"TO02.E",{"$f":"IFERROR(VLOOKUP(L241,'Input Wonen'!$P$13:$T$151,COLUMNS('Input Wonen'!P:Q),FALSE),\"\")","v":"Buitenriolering"},{"$f":"IFERROR(VLOOKUP(L241,'Input Wonen'!$P$13:$T$151,COLUMNS('Input Wonen'!P:R),FALSE),\"\")","v":"Gerecycled PVC (Pipelife)"}]
[null,null,null,"TO03.t",{"$f":"VLOOKUP(D242,'Input Wonen'!$D$13:$H$151,2,FALSE)","v":"Binnenriolering"},{"$f":"VLOOKUP(D242,'Input Wonen'!$D$13:$H$151,3,FALSE)","v":"PVC"},null,"TO03.HNN",{"$f":"IFERROR(VLOOKUP(H242,'Input Wonen'!$J$13:$N$151,COLUMNS('Input Wonen'!J:K),FALSE),\"\")","v":"Binnenriolering"},{"$f":"IFERROR(VLOOKUP(H242,'Input Wonen'!$J$13:$N$151,COLUMNS('Input Wonen'!J:L),FALSE),\"\")","v":"Gerecycled PVC (Pipelife)"},null,"TO03.E",{"$f":"IFERROR(VLOOKUP(L242,'Input Wonen'!$P$13:$T$151,COLUMNS('Input Wonen'!P:Q),FALSE),\"\")","v":"Binnenriolering"},{"$f":"IFERROR(VLOOKUP(L242,'Input Wonen'!$P$13:$T$151,COLUMNS('Input Wonen'!P:R),FALSE),\"\")","v":"Gerecycled PVC (Pipelife)"}]
[null,null,null,"TO04.t",{"$f":"VLOOKUP(D243,'Input Wonen'!$D$13:$H$151,2,FALSE)","v":"Hemelwaterafvoer"},{"$f":"VLOOKUP(D243,'Input Wonen'!$D$13:$H$151,3,FALSE)","v":"PVC"},null,"TO04.HNN",{"$f":"IFERROR(VLOOKUP(H243,'Input Wonen'!$J$13:$N$151,COLUMNS('Input Wonen'!J:K),FALSE),\"\")","v":"Hemelwaterafvoer"},{"$f":"IFERROR(VLOOKUP(H243,'Input Wonen'!$J$13:$N$151,COLUMNS('Input Wonen'!J:L),FALSE),\"\")","v":"Gerecycled PVC (Pipelife)"},null,"TO04.E",{"$f":"IFERROR(VLOOKUP(L243,'Input Wonen'!$P$13:$T$151,COLUMNS('Input Wonen'!P:Q),FALSE),\"\")","v":"Hemelwaterafvoer"},{"$f":"IFERROR(VLOOKUP(L243,'Input Wonen'!$P$13:$T$151,COLUMNS('Input Wonen'!P:R),FALSE),\"\")","v":"Gerecycled PVC (Pipelife)"}]
[null,null,null,null,"Verkeersruimte",null,null,null,"Verkeersruimte",null,null,null,"Verkeersruimte"]
[null,null,null,"VE01.t",{"$f":"VLOOKUP(D245,'Input Wonen'!$D$13:$H$151,2,FALSE)","v":"Interne trap"},{"$f":"VLOOKUP(D245,'Input Wonen'!$D$13:$H$151,3,FALSE)","v":"Eur. loofhout; geschilderd"},null,"VE01.HNN",{"$f":"IFERROR(VLOOKUP(H245,'Input Wonen'!$J$13:$N$151,COLUMNS('Input Wonen'!J:K),FALSE),\"\")","v":"Interne trap"},{"$f":"IFERROR(VLOOKUP(H245,'Input Wonen'!$J$13:$N$151,COLUMNS('Input Wonen'!J:L),FALSE),\"\")","v":"Eur. loofhout; geschilderd"},null,"VE01.E",{"$f":"IFERROR(VLOOKUP(L245,'Input Wonen'!$P$13:$T$151,COLUMNS('Input Wonen'!P:Q),FALSE),\"\")","v":"Interne trap"},{"$f":"IFERROR(VLOOKUP(L245,'Input Wonen'!$P$13:$T$151,COLUMNS('Input Wonen'!P:R),FALSE),\"\")","v":"Eur. loofhout; geschilderd"}]
[null,null,null,"VE03.t",{"$f":"VLOOKUP(D246,'Input Wonen'!$D$13:$H$151,2,FALSE)","v":"Balustrades"},{"$f":"VLOOKUP(D246,'Input Wonen'!$D$13:$H$151,3,FALSE)","v":"Eur. loofhout; spijlen; duurzame bosbouw"},null,"VE03.HNN",{"$f":"IFERROR(VLOOKUP(H246,'Input Wonen'!$J$13:$N$151,COLUMNS('Input Wonen'!J:K),FALSE),\"\")","v":"Balustrades"},{"$f":"IFERROR(VLOOKUP(H246,'Input Wonen'!$J$13:$N$151,COLUMNS('Input Wonen'!J:L),FALSE),\"\")","v":"Eur. loofhout; spijlen; duurzame bosbouw"},null,"VE03.E",{"$f":"IFERROR(VLOOKUP(L246,'Input Wonen'!$P$13:$T$151,COLUMNS('Input Wonen'!P:Q),FALSE),\"\")","v":"Balustrades"},{"$f":"IFERROR(VLOOKUP(L246,'Input Wonen'!$P$13:$T$151,COLUMNS('Input Wonen'!P:R),FALSE),\"\")","v":"Eur. loofhout; spijlen; duurzame bosbouw"}]
[null,null,null,"VE05.t",{"$f":"VLOOKUP(D247,'Input Wonen'!$D$13:$H$151,2,FALSE)","v":"Leuningen"},{"$f":"VLOOKUP(D247,'Input Wonen'!$D$13:$H$151,3,FALSE)","v":"Eur. loofhout; duurzame bosbouw"},null,"VE05.HNN",{"$f":"IFERROR(VLOOKUP(H247,'Input Wonen'!$J$13:$N$151,COLUMNS('Input Wonen'!J:K),FALSE),\"\")","v":"Leuningen"},{"$f":"IFERROR(VLOOKUP(H247,'Input Wonen'!$J$13:$N$151,COLUMNS('Input Wonen'!J:L),FALSE),\"\")","v":"Eur. loofhout; duurzame bosbouw"},null,"VE05.E",{"$f":"IFERROR(VLOOKUP(L247,'Input Wonen'!$P$13:$T$151,COLUMNS('Input Wonen'!P:Q),FALSE),\"\")","v":"Leuningen"},{"$f":"IFERROR(VLOOKUP(L247,'Input Wonen'!$P$13:$T$151,COLUMNS('Input Wonen'!P:R),FALSE),\"\")","v":"Eur. loofhout; duurzame bosbouw"}]
[null,null,null,null,"Vaste voorzieningen",null,null,null,"Vaste voorzieningen",null,null,null,"Vaste voorzieningen"]
[null,null,null,"VA01.t",{"$f":"VLOOKUP(D249,'Input Wonen'!$D$13:$H$151,2,FALSE)","v":"Toiletten; wandcloset + fontein"},{"$f":"VLOOKUP(D249,'Input Wonen'!$D$13:$H$151,3,FALSE)","v":"Porselein"},null,"VA01.HNN",{"$f":"IFERROR(VLOOKUP(H249,'Input Wonen'!$J$13:$N$151,COLUMNS('Input Wonen'!J:K),FALSE),\"\")","v":"Toiletten; wandcloset + fontein"},{"$f":"IFERROR(VLOOKUP(H249,'Input Wonen'!$J$13:$N$151,COLUMNS('Input Wonen'!J:L),FALSE),\"\")","v":"Porselein"},null,"VA01.E",{"$f":"IFERROR(VLOOKUP(L249,'Input Wonen'!$P$13:$T$151,COLUMNS('Input Wonen'!P:Q),FALSE),\"\")","v":"Toiletten; wandcloset + fontein"},{"$f":"IFERROR(VLOOKUP(L249,'Input Wonen'!$P$13:$T$151,COLUMNS('Input Wonen'!P:R),FALSE),\"\")","v":"Porselein"}]
[null,null,null,"VA02.t",{"$f":"VLOOKUP(D250,'Input Wonen'!$D$13:$H$151,2,FALSE)","v":"Wastafel"},{"$f":"VLOOKUP(D250,'Input Wonen'!$D$13:$H$151,3,FALSE)","v":"Keramisch"},null,"VA02.HNN",{"$f":"IFERROR(VLOOKUP(H250,'Input Wonen'!$J$13:$N$151,COLUMNS('Input Wonen'!J:K),FALSE),\"\")","v":"Wastafel"},{"$f":"IFERROR(VLOOKUP(H250,'Input Wonen'!$J$13:$N$151,COLUMNS('Input Wonen'!J:L),FALSE),\"\")","v":"Keramisch"},null,"VA02.E",{"$f":"IFERROR(VLOOKUP(L250,'Input Wonen'!$P$13:$T$151,COLUMNS('Input Wonen'!P:Q),FALSE),\"\")","v":"Wastafel"},{"$f":"IFERROR(VLOOKUP(L250,'Input Wonen'!$P$13:$T$151,COLUMNS('Input Wonen'!P:R),FALSE),\"\")","v":"Keramisch"}]
[null,null,null,"VA03.t",{"$f":"VLOOKUP(D251,'Input Wonen'!$D$13:$H$151,2,FALSE)","v":"Inloopdouche"},{"$f":"VLOOKUP(D251,'Input Wonen'!$D$13:$H$151,3,FALSE)","v":"Gipsblokken + tegels incl. rvs afvoergoot"},null,"VA03.HNN",{"$f":"IFERROR(VLOOKUP(H251,'Input Wonen'!$J$13:$N$151,COLUMNS('Input Wonen'!J:K),FALSE),\"\")","v":"Inloopdouche"},{"$f":"IFERROR(VLOOKUP(H251,'Input Wonen'!$J$13:$N$151,COLUMNS('Input Wonen'!J:L),FALSE),\"\")","v":"Gipsblokken + tegels incl. rvs afvoergoot"},null,"VA03.E",{"$f":"IFERROR(VLOOKUP(L251,'Input Wonen'!$P$13:$T$151,COLUMNS('Input Wonen'!P:Q),FALSE),\"\")","v":"Inloopdouche"},{"$f":"IFERROR(VLOOKUP(L251,'Input Wonen'!$P$13:$T$151,COLUMNS('Input Wonen'!P:R),FALSE),\"\")","v":"Gipsblokken + tegels incl. rvs afvoergoot"}]
[null,null,null,null,"Overige kosten",null,null,null,"Overige kosten",null,null,null,"Overige kosten"]
[null,null,null,"OK01.t",{"$f":"VLOOKUP(D253,'Input Wonen'!$D$13:$H$165,2,FALSE)","v":"Grondwerk, maatvoering, invoeren en sparingen"},null,null,"OK01.HNN",{"$f":"VLOOKUP(H253,'Input Wonen'!$J$13:$N$165,2,FALSE)","v":"Grondwerk, maatvoering, invoeren en sparingen"},null,null,"OK01.E",{"$f":"VLOOKUP(H253,'Input Wonen'!$J$13:$N$165,2,FALSE)","v":"Grondwerk, maatvoering, invoeren en sparingen"}]
[null,null,null,"OK02.t",{"$f":"VLOOKUP(D254,'Input Wonen'!$D$13:$H$165,2,FALSE)","v":"Gevelsteiger"},null,null,"OK02.HNN",{"$f":"VLOOKUP(H254,'Input Wonen'!$J$13:$N$165,2,FALSE)","v":"Gevelsteiger"},null,null,"OK02.E",{"$f":"VLOOKUP(H254,'Input Wonen'!$J$13:$N$165,2,FALSE)","v":"Gevelsteiger"}]
[null,null,null,"OK04.t",{"$f":"VLOOKUP(D255,'Input Wonen'!$D$13:$H$165,2,FALSE)","v":"Afbouwwerkzaamheden (klein timmerwerk, schilderwerk)"},null,null,"OK04.HNN",{"$f":"VLOOKUP(H255,'Input Wonen'!$J$13:$N$165,2,FALSE)","v":"Afbouwwerkzaamheden (klein timmerwerk, schilderwerk)"},null,null,"OK04.E",{"$f":"VLOOKUP(H255,'Input Wonen'!$J$13:$N$165,2,FALSE)","v":"Afbouwwerkzaamheden (klein timmerwerk, schilderwerk)"}]
[null,null,null,"OK07b.t",{"$f":"VLOOKUP(D256,'Input Wonen'!$D$13:$H$165,2,FALSE)","v":"Installaties (E, W & klimaat) grondgebonden woning tussen"},{"$f":"VLOOKUP(D256,'Input Wonen'!$D$13:$H$165,3,FALSE)","v":0},null,"OK07b.HNN",{"$f":"VLOOKUP(H256,'Input Wonen'!$J$13:$N$165,2,FALSE)","v":"Installaties (E, W & klimaat) grondgebonden woning tussen"},null,null,"OK07b.E",{"$f":"VLOOKUP(D256,'Input Wonen'!$D$13:$H$165,2,FALSE)","v":"Installaties (E, W & klimaat) grondgebonden woning tussen"}]
[]
[]
[null,null,null,null,"Traditioneel (RVO Referentieprojecten)",null,null,null,"Het Nieuwe Normaal",null,null,null,"Het Nieuwe Normaal ambitieus"]
[]
[null,null,null,null,"WONEN",null,null,null,"WONEN",null,null,null,"WONEN"]
[]
[]
[]
[]
[]
[]
[null,null,null,null,null,null,null,{"$f":"0.696-I268","v":0.61049999999999993},{"$f":"0.095-0.0095","v":8.5500000000000007E-2}]
[]
[]
[]
[]
[]
[]
[null,null,null,null,"Woongebouw M",null,null,null,"Woongebouw M",null,null,null,"Woongebouw M"]
[null,null,null,null,"Element","Materialisatie",null,null,"Element","Materialisatie",null,null,"Element","Materialisatie"]
[]
[null,null,null,null,"Fundering",null,null,null,"Fundering",null,null,null,"Fundering"]
[null,null,null,"FU12.t",{"$f":"VLOOKUP(D279,'Input Wonen'!$D$13:$H$151,2,FALSE)","v":"Funderingspaal, ⌀ 350mm; l=15,0m"},{"$f":"VLOOKUP(D279,'Input Wonen'!$D$13:$H$151,3,FALSE)","v":"Schroefpaal; beton, in het werk gestort, C20/25,CEMIII; incl.wapening"},null,"FU12.HNN",{"$f":"IFERROR(VLOOKUP(H279,'Input Wonen'!$J$13:$N$151,COLUMNS('Input Wonen'!J:K),FALSE),\"\")","v":"Funderingspaal, ⌀ 350mm; l=15,0m"},{"$f":"IFERROR(VLOOKUP(H279,'Input Wonen'!$J$13:$N$151,COLUMNS('Input Wonen'!J:L),FALSE),\"\")","v":"Beton met 56% aan secundair aandeel (UMC)"},null,"FU12.E",{"$f":"IFERROR(VLOOKUP(L279,'Input Wonen'!$P$13:$T$151,COLUMNS('Input Wonen'!P:Q),FALSE),\"\")","v":"Funderingspaal, ⌀ 350mm; l=15,0m"},{"$f":"IFERROR(VLOOKUP(L279,'Input Wonen'!$P$13:$T$151,COLUMNS('Input Wonen'!P:R),FALSE),\"\")","v":"Beton met 56% aan secundair aandeel (UMC)"}]
[null,null,null,"FU02.t",{"$f":"VLOOKUP(D280,'Input Wonen'!$D$13:$H$151,2,FALSE)","v":"Funderingsbalken, 400x500mm"},{"$f":"VLOOKUP(D280,'Input Wonen'!$D$13:$H$151,3,FALSE)","v":"In het werk gestort"},null,"FU02.HNN",{"$f":"IFERROR(VLOOKUP(H280,'Input Wonen'!$J$13:$N$151,COLUMNS('Input Wonen'!J:K),FALSE),\"\")","v":"Funderingsbalken, 400x500mm"},{"$f":"IFERROR(VLOOKUP(H280,'Input Wonen'!$J$13:$N$151,COLUMNS('Input Wonen'!J:L),FALSE),\"\")","v":"Beton met 56% aan secundair aandeel (UMC)"},null,"FU02.E",{"$f":"IFERROR(VLOOKUP(L280,'Input Wonen'!$P$13:$T$151,COLUMNS('Input Wonen'!P:Q),FALSE),\"\")","v":"Funderingsbalken, 400x500mm"},{"$f":"IFERROR(VLOOKUP(L280,'Input Wonen'!$P$13:$T$151,COLUMNS('Input Wonen'!P:R),FALSE),\"\")","v":"Beton met 56% aan secundair aandeel (UMC)"}]
[null,null,null,"FU05.t",{"$f":"VLOOKUP(D281,'Input Wonen'!$D$13:$H$151,2,FALSE)","v":"Bodemafsluiting, zand"},{"$f":"VLOOKUP(D281,'Input Wonen'!$D$13:$H$151,3,FALSE)","v":"Zand"},null,"FU05.HNN",{"$f":"IFERROR(VLOOKUP(H281,'Input Wonen'!$J$13:$N$151,COLUMNS('Input Wonen'!J:K),FALSE),\"\")","v":"Bodemafsluiting, 100 zand"},{"$f":"IFERROR(VLOOKUP(H281,'Input Wonen'!$J$13:$N$151,COLUMNS('Input Wonen'!J:L),FALSE),\"\")","v":"Zand"},null,"FU05.E",{"$f":"IFERROR(VLOOKUP(L281,'Input Wonen'!$P$13:$T$151,COLUMNS('Input Wonen'!P:Q),FALSE),\"\")","v":"Bodemafsluiting, 100 zand"},{"$f":"IFERROR(VLOOKUP(L281,'Input Wonen'!$P$13:$T$151,COLUMNS('Input Wonen'!P:R),FALSE),\"\")","v":"Zand"}]
[null,null,null,null,"Vloeren",null,null,null,"Vloeren",null,null,null,"Vloeren"]
[null,null,null,"VL11.t",{"$f":"VLOOKUP(D283,'Input Wonen'!$D$13:$H$151,2,FALSE)","v":"BG: kanaalplaatvloer, 200mm incl. isolatie (Rc=3,7)"},{"$f":"VLOOKUP(D283,'Input Wonen'!$D$13:$H$151,3,FALSE)","v":"Kanaalplaatvloer; prefab beton"},null,"VL11.HNN",{"$f":"IFERROR(VLOOKUP(H283,'Input Wonen'!$J$13:$N$151,COLUMNS('Input Wonen'!J:K),FALSE),\"\")","v":"BG: kanaalplaatvloer, 200mm incl. isolatie (Rc=3,7)"},{"$f":"IFERROR(VLOOKUP(H283,'Input Wonen'!$J$13:$N$151,COLUMNS('Input Wonen'!J:L),FALSE),\"\")","v":"Kanaalplaat, remontabel (28% recyclaat)"},null,"VL11.E",{"$f":"IFERROR(VLOOKUP(L283,'Input Wonen'!$P$13:$T$151,COLUMNS('Input Wonen'!P:Q),FALSE),\"\")","v":"BG: kanaalplaatvloer, 200mm incl. isolatie (Rc=3,7)"},{"$f":"IFERROR(VLOOKUP(L283,'Input Wonen'!$P$13:$T$151,COLUMNS('Input Wonen'!P:R),FALSE),\"\")","v":"Kanaalplaat, remontabel (28% recyclaat)"}]
[null,null,null,"VL07.t",{"$f":"VLOOKUP(D284,'Input Wonen'!$D$13:$H$151,2,FALSE)","v":"Dekvloeren, 60mm"},{"$f":"VLOOKUP(D284,'Input Wonen'!$D$13:$H$151,3,FALSE)","v":"Zandcement dekvloer"},null,"VL07.HNN",{"$f":"IFERROR(VLOOKUP(H284,'Input Wonen'!$J$13:$N$151,COLUMNS('Input Wonen'!J:K),FALSE),\"\")","v":"Dekvloeren, 60mm"},{"$f":"IFERROR(VLOOKUP(H284,'Input Wonen'!$J$13:$N$151,COLUMNS('Input Wonen'!J:L),FALSE),\"\")","v":"Fermacell honingraatvloer (op houten vloer)"},null,"VL07.E",{"$f":"IFERROR(VLOOKUP(L284,'Input Wonen'!$P$13:$T$151,COLUMNS('Input Wonen'!P:Q),FALSE),\"\")","v":"Dekvloeren, 60mm"},{"$f":"IFERROR(VLOOKUP(L284,'Input Wonen'!$P$13:$T$151,COLUMNS('Input Wonen'!P:R),FALSE),\"\")","v":"Fermacell honingraatvloer (op houten vloer)"}]
[null,null,null,"VL04.t",{"$f":"VLOOKUP(D285,'Input Wonen'!$D$13:$H$151,2,FALSE)","v":"Vloertegelwerk badkamer"},{"$f":"VLOOKUP(D285,'Input Wonen'!$D$13:$H$151,3,FALSE)","v":"Keramische tegels, geglazuurd/gelijmd"},null,"VL04.HNN",{"$f":"IFERROR(VLOOKUP(H285,'Input Wonen'!$J$13:$N$151,COLUMNS('Input Wonen'!J:K),FALSE),\"\")","v":"Vloertegelwerk badkamer"},{"$f":"IFERROR(VLOOKUP(H285,'Input Wonen'!$J$13:$N$151,COLUMNS('Input Wonen'!J:L),FALSE),\"\")","v":"Mosa C2C vloertegels"},null,"VL04.E",{"$f":"IFERROR(VLOOKUP(L285,'Input Wonen'!$P$13:$T$151,COLUMNS('Input Wonen'!P:Q),FALSE),\"\")","v":"Vloertegelwerk badkamer"},{"$f":"IFERROR(VLOOKUP(L285,'Input Wonen'!$P$13:$T$151,COLUMNS('Input Wonen'!P:R),FALSE),\"\")","v":"Mosa C2C vloertegels (losmaakbaar)"}]
[null,null,null,"VL05.t",{"$f":"VLOOKUP(D286,'Input Wonen'!$D$13:$H$151,2,FALSE)","v":"VV: breedplaatvloer, 270mm incl. druklaag"},{"$f":"VLOOKUP(D286,'Input Wonen'!$D$13:$H$151,3,FALSE)","v":"Breedplaatvloer; incl. druklaag "},null,"VL05.HNN",{"$f":"IFERROR(VLOOKUP(H286,'Input Wonen'!$J$13:$N$151,COLUMNS('Input Wonen'!J:K),FALSE),\"\")","v":"VV: breedplaatvloer, 270mm incl. druklaag"},{"$f":"IFERROR(VLOOKUP(H286,'Input Wonen'!$J$13:$N$151,COLUMNS('Input Wonen'!J:L),FALSE),\"\")","v":"Breedplaatvloer; incl. druklaag (UMC)"},null,"VL05.E",{"$f":"IFERROR(VLOOKUP(L286,'Input Wonen'!$P$13:$T$151,COLUMNS('Input Wonen'!P:Q),FALSE),\"\")","v":"VV: CLT incl. dekvloer"},{"$f":"IFERROR(VLOOKUP(L286,'Input Wonen'!$P$13:$T$151,COLUMNS('Input Wonen'!P:R),FALSE),\"\")","v":"CLT verdiepingsvloer "}]
[null,null,null,"VL07.t",{"$f":"VLOOKUP(D287,'Input Wonen'!$D$13:$H$151,2,FALSE)","v":"Dekvloeren, 60mm"},{"$f":"VLOOKUP(D287,'Input Wonen'!$D$13:$H$151,3,FALSE)","v":"Zandcement dekvloer"},null,"VL07.HNN",{"$f":"IFERROR(VLOOKUP(H287,'Input Wonen'!$J$13:$N$151,COLUMNS('Input Wonen'!J:K),FALSE),\"\")","v":"Dekvloeren, 60mm"},{"$f":"IFERROR(VLOOKUP(H287,'Input Wonen'!$J$13:$N$151,COLUMNS('Input Wonen'!J:L),FALSE),\"\")","v":"Fermacell honingraatvloer (op houten vloer)"},null,"VL07.E",{"$f":"IFERROR(VLOOKUP(L287,'Input Wonen'!$P$13:$T$151,COLUMNS('Input Wonen'!P:Q),FALSE),\"\")","v":"Dekvloeren, 60mm"},{"$f":"IFERROR(VLOOKUP(L287,'Input Wonen'!$P$13:$T$151,COLUMNS('Input Wonen'!P:R),FALSE),\"\")","v":"Fermacell honingraatvloer (op houten vloer)"}]
[null,null,null,"VL04.t",{"$f":"VLOOKUP(D288,'Input Wonen'!$D$13:$H$151,2,FALSE)","v":"Vloertegelwerk badkamer"},{"$f":"VLOOKUP(D288,'Input Wonen'!$D$13:$H$151,3,FALSE)","v":"Keramische tegels, geglazuurd/gelijmd"},null,"VL04.HNN",{"$f":"IFERROR(VLOOKUP(H288,'Input Wonen'!$J$13:$N$151,COLUMNS('Input Wonen'!J:K),FALSE),\"\")","v":"Vloertegelwerk badkamer"},{"$f":"IFERROR(VLOOKUP(H288,'Input Wonen'!$J$13:$N$151,COLUMNS('Input Wonen'!J:L),FALSE),\"\")","v":"Mosa C2C vloertegels"},null,"VL04.E",{"$f":"IFERROR(VLOOKUP(L288,'Input Wonen'!$P$13:$T$151,COLUMNS('Input Wonen'!P:Q),FALSE),\"\")","v":"Vloertegelwerk badkamer"},{"$f":"IFERROR(VLOOKUP(L288,'Input Wonen'!$P$13:$T$151,COLUMNS('Input Wonen'!P:R),FALSE),\"\")","v":"Mosa C2C vloertegels (losmaakbaar)"}]
[null,null,null,"VL09.t",{"$f":"VLOOKUP(D289,'Input Wonen'!$D$13:$H$151,2,FALSE)","v":"Balkon- en galerijvloeren"},{"$f":"VLOOKUP(D289,'Input Wonen'!$D$13:$H$151,3,FALSE)","v":"Prefab beton, 250mm"},null,"VL09.HNN",{"$f":"IFERROR(VLOOKUP(H289,'Input Wonen'!$J$13:$N$151,COLUMNS('Input Wonen'!J:K),FALSE),\"\")","v":"Balkon- en galerijvloeren"},{"$f":"IFERROR(VLOOKUP(H289,'Input Wonen'!$J$13:$N$151,COLUMNS('Input Wonen'!J:L),FALSE),\"\")","v":"Prefab beton, 250mm"},null,"VL09.E",{"$f":"IFERROR(VLOOKUP(L289,'Input Wonen'!$P$13:$T$151,COLUMNS('Input Wonen'!P:Q),FALSE),\"\")","v":"Balkon- en galerijvloeren"},{"$f":"IFERROR(VLOOKUP(L289,'Input Wonen'!$P$13:$T$151,COLUMNS('Input Wonen'!P:R),FALSE),\"\")","v":"HSB element houten vloer + stalen ophanging (56,8 kg/m2 zie detail berekening excel)"}]
[null,null,null,"VL10.t",{"$f":"VLOOKUP(D290,'Input Wonen'!$D$13:$H$151,2,FALSE)","v":"Balustrades"},{"$f":"VLOOKUP(D290,'Input Wonen'!$D$13:$H$151,3,FALSE)","v":"Aluminium; geanodiseerd"},null,"VL10.HNN",{"$f":"IFERROR(VLOOKUP(H290,'Input Wonen'!$J$13:$N$151,COLUMNS('Input Wonen'!J:K),FALSE),\"\")","v":"Balustrades"},{"$f":"IFERROR(VLOOKUP(H290,'Input Wonen'!$J$13:$N$151,COLUMNS('Input Wonen'!J:L),FALSE),\"\")","v":"Houten balustrades"},null,"VL10.E",{"$f":"IFERROR(VLOOKUP(L290,'Input Wonen'!$P$13:$T$151,COLUMNS('Input Wonen'!P:Q),FALSE),\"\")","v":"Balustrades"},{"$f":"IFERROR(VLOOKUP(L290,'Input Wonen'!$P$13:$T$151,COLUMNS('Input Wonen'!P:R),FALSE),\"\")","v":"Houten balustrades"}]
[null,null,null,null,"Gevel",null,null,null,"Gevel",null,null,null,"Gevel"]
[null,null,null,"GE50.t",{"$f":"VLOOKUP(D292,'Input Wonen'!$D$13:$H$151,2,FALSE)","v":"Gevelkozijnen; incl. HR++ beglazing"},{"$f":"VLOOKUP(D292,'Input Wonen'!$D$13:$H$151,3,FALSE)","v":"Az. loofhout (Meranti), geschilderd"},null,"GE50.HNN",{"$f":"IFERROR(VLOOKUP(H292,'Input Wonen'!$J$13:$N$151,COLUMNS('Input Wonen'!J:K),FALSE),\"\")","v":"Gevelkozijnen; incl. HR++ beglazing"},{"$f":"IFERROR(VLOOKUP(H292,'Input Wonen'!$J$13:$N$151,COLUMNS('Input Wonen'!J:L),FALSE),\"\")","v":"Europees naaldhout, geschilderd"},null,"GE50.E",{"$f":"IFERROR(VLOOKUP(L292,'Input Wonen'!$P$13:$T$151,COLUMNS('Input Wonen'!P:Q),FALSE),\"\")","v":"Gevelkozijnen; incl. Isomax beglazing"},{"$f":"IFERROR(VLOOKUP(L292,'Input Wonen'!$P$13:$T$151,COLUMNS('Input Wonen'!P:R),FALSE),\"\")","v":"Europees naaldhout, geschilderd"}]
[null,null,null,"GE03.t",{"$f":"VLOOKUP(D293,'Input Wonen'!$D$13:$H$151,2,FALSE)","v":"Stelkozijnen"},{"$f":"VLOOKUP(D293,'Input Wonen'!$D$13:$H$151,3,FALSE)","v":"Onverduurzaamd hout, geverfd"},null,"GE03.HNN",{"$f":"IFERROR(VLOOKUP(H293,'Input Wonen'!$J$13:$N$151,COLUMNS('Input Wonen'!J:K),FALSE),\"\")","v":"Stelkozijnen"},{"$f":"IFERROR(VLOOKUP(H293,'Input Wonen'!$J$13:$N$151,COLUMNS('Input Wonen'!J:L),FALSE),\"\")","v":"Onverduurzaamd hout, geverfd"},null,"GE03.E",{"$f":"IFERROR(VLOOKUP(L293,'Input Wonen'!$P$13:$T$151,COLUMNS('Input Wonen'!P:Q),FALSE),\"\")","v":"Stelkozijnen"},{"$f":"IFERROR(VLOOKUP(L293,'Input Wonen'!$P$13:$T$151,COLUMNS('Input Wonen'!P:R),FALSE),\"\")","v":"Onverduurzaamd hout, geverfd"}]
[null,null,null,"GE04.t",{"$f":"VLOOKUP(D294,'Input Wonen'!$D$13:$H$151,2,FALSE)","v":"Vensterbanken"},{"$f":"VLOOKUP(D294,'Input Wonen'!$D$13:$H$151,3,FALSE)","v":"Composietsteen "},null,"GE04.HNN",{"$f":"IFERROR(VLOOKUP(H294,'Input Wonen'!$J$13:$N$151,COLUMNS('Input Wonen'!J:K),FALSE),\"\")","v":"Vensterbanken"},{"$f":"IFERROR(VLOOKUP(H294,'Input Wonen'!$J$13:$N$151,COLUMNS('Input Wonen'!J:L),FALSE),\"\")","v":"Composietsteen"},null,"GE04.E",{"$f":"IFERROR(VLOOKUP(L294,'Input Wonen'!$P$13:$T$151,COLUMNS('Input Wonen'!P:Q),FALSE),\"\")","v":"Vensterbanken"},{"$f":"IFERROR(VLOOKUP(L294,'Input Wonen'!$P$13:$T$151,COLUMNS('Input Wonen'!P:R),FALSE),\"\")","v":"Composietsteen"}]
[null,null,null,"GE05.t",{"$f":"VLOOKUP(D295,'Input Wonen'!$D$13:$H$151,2,FALSE)","v":"Waterslagen"},{"$f":"VLOOKUP(D295,'Input Wonen'!$D$13:$H$151,3,FALSE)","v":"Prefab beton"},null,"GE05.HNN",{"$f":"IFERROR(VLOOKUP(H295,'Input Wonen'!$J$13:$N$151,COLUMNS('Input Wonen'!J:K),FALSE),\"\")","v":"Waterslagen"},{"$f":"IFERROR(VLOOKUP(H295,'Input Wonen'!$J$13:$N$151,COLUMNS('Input Wonen'!J:L),FALSE),\"\")","v":"Prefab beton"},null,"GE05.E",{"$f":"IFERROR(VLOOKUP(L295,'Input Wonen'!$P$13:$T$151,COLUMNS('Input Wonen'!P:Q),FALSE),\"\")","v":"Waterslagen"},{"$f":"IFERROR(VLOOKUP(L295,'Input Wonen'!$P$13:$T$151,COLUMNS('Input Wonen'!P:R),FALSE),\"\")","v":"Prefab beton"}]
[null,null,null,"GE22.t",{"$f":"VLOOKUP(D296,'Input Wonen'!$D$13:$H$151,2,FALSE)","v":"Lateien"},{"$f":"VLOOKUP(D296,'Input Wonen'!$D$13:$H$151,3,FALSE)","v":"Prefab beton"},null,"GE22.HNN",{"$f":"IFERROR(VLOOKUP(H296,'Input Wonen'!$J$13:$N$151,COLUMNS('Input Wonen'!J:K),FALSE),\"\")","v":"Lateien"},{"$f":"IFERROR(VLOOKUP(H296,'Input Wonen'!$J$13:$N$151,COLUMNS('Input Wonen'!J:L),FALSE),\"\")","v":"Prefab beton"},null,"GE22.E",{"$f":"IFERROR(VLOOKUP(L296,'Input Wonen'!$P$13:$T$151,COLUMNS('Input Wonen'!P:Q),FALSE),\"\")","v":"Lateien"},{"$f":"IFERROR(VLOOKUP(L296,'Input Wonen'!$P$13:$T$151,COLUMNS('Input Wonen'!P:R),FALSE),\"\")","v":"Prefab beton"}]
[null,null,null,"GE34.t",{"$f":"VLOOKUP(D297,'Input Wonen'!$D$13:$H$151,2,FALSE)","v":"Buitendeur; multiplex"},{"$f":"VLOOKUP(D297,'Input Wonen'!$D$13:$H$151,3,FALSE)","v":"Sandwich; 2x multiplex"},null,"GE34.HNN",{"$f":"IFERROR(VLOOKUP(H297,'Input Wonen'!$J$13:$N$151,COLUMNS('Input Wonen'!J:K),FALSE),\"\")","v":"Buitendeur; multiplex"},{"$f":"IFERROR(VLOOKUP(H297,'Input Wonen'!$J$13:$N$151,COLUMNS('Input Wonen'!J:L),FALSE),\"\")","v":"Sandwich; 2x multiplex"},null,"GE34.E",{"$f":"IFERROR(VLOOKUP(L297,'Input Wonen'!$P$13:$T$151,COLUMNS('Input Wonen'!P:Q),FALSE),\"\")","v":"Buitendeur; multiplex"},{"$f":"IFERROR(VLOOKUP(L297,'Input Wonen'!$P$13:$T$151,COLUMNS('Input Wonen'!P:R),FALSE),\"\")","v":"Sandwich; 2x multiplex"}]
[null,null,null,"GE11.t",{"$f":"VLOOKUP(D298,'Input Wonen'!$D$13:$H$151,2,FALSE)","v":"Binnenspouwblad, 100mm (bruto)"},{"$f":"VLOOKUP(D298,'Input Wonen'!$D$13:$H$151,3,FALSE)","v":"Prefab beton"},null,"GE11.HNN",{"$f":"IFERROR(VLOOKUP(H298,'Input Wonen'!$J$13:$N$151,COLUMNS('Input Wonen'!J:K),FALSE),\"\")","v":"Binnenspouwblad, 100mm (bruto)"},{"$f":"IFERROR(VLOOKUP(H298,'Input Wonen'!$J$13:$N$151,COLUMNS('Input Wonen'!J:L),FALSE),\"\")","v":"Prefab beton (UMC)"},null,"GE11.E",{"$f":"IFERROR(VLOOKUP(L298,'Input Wonen'!$P$13:$T$151,COLUMNS('Input Wonen'!P:Q),FALSE),\"\")","v":"Binnenspouwblad, HSB (bruto)"},{"$f":"IFERROR(VLOOKUP(L298,'Input Wonen'!$P$13:$T$151,COLUMNS('Input Wonen'!P:R),FALSE),\"\")","v":"HSB element incl. Isovlas isolatie"}]
[null,null,null,"GE10.t",{"$f":"VLOOKUP(D299,'Input Wonen'!$D$13:$H$151,2,FALSE)","v":"Isolatielagen, Rc=4,7"},{"$f":"VLOOKUP(D299,'Input Wonen'!$D$13:$H$151,3,FALSE)","v":"PUR/PIR schuimplaten"},null,"GE10.HNN",{"$f":"IFERROR(VLOOKUP(H299,'Input Wonen'!$J$13:$N$151,COLUMNS('Input Wonen'!J:K),FALSE),\"\")","v":"Isolatielagen, Rc=4,7"},{"$f":"IFERROR(VLOOKUP(H299,'Input Wonen'!$J$13:$N$151,COLUMNS('Input Wonen'!J:L),FALSE),\"\")","v":"Isovlas plaat, PN160mm"},null,"GE10.E",{"$f":"IFERROR(VLOOKUP(L299,'Input Wonen'!$P$13:$T$151,COLUMNS('Input Wonen'!P:Q),FALSE),\"\")","v":"Isolatielagen, Rc=4,7"},{"$f":"IFERROR(VLOOKUP(L299,'Input Wonen'!$P$13:$T$151,COLUMNS('Input Wonen'!P:R),FALSE),\"\")","v":"Isovlas plaat, PN160mm"}]
[null,null,null,"GE09.t",{"$f":"VLOOKUP(D300,'Input Wonen'!$D$13:$H$151,2,FALSE)","v":"Buitenspouwblad, 100mm"},{"$f":"VLOOKUP(D300,'Input Wonen'!$D$13:$H$151,3,FALSE)","v":"Baksteenmetselwerk"},null,"GE09.HNN",{"$f":"IFERROR(VLOOKUP(H300,'Input Wonen'!$J$13:$N$151,COLUMNS('Input Wonen'!J:K),FALSE),\"\")","v":"Buitenspouwblad"},{"$f":"IFERROR(VLOOKUP(H300,'Input Wonen'!$J$13:$N$151,COLUMNS('Input Wonen'!J:L),FALSE),\"\")","v":"Ecobrick Wienerberger"},null,"GE09.E",{"$f":"IFERROR(VLOOKUP(L300,'Input Wonen'!$P$13:$T$151,COLUMNS('Input Wonen'!P:Q),FALSE),\"\")","v":"Buitenspouwblad"},{"$f":"IFERROR(VLOOKUP(L300,'Input Wonen'!$P$13:$T$151,COLUMNS('Input Wonen'!P:R),FALSE),\"\")","v":"Houten gevelbekleding; Meranti delen"}]
[null,null,null,null,"Daken",null,null,null,"Daken",null,null,null,"Daken"]
[null,null,null,"DA02.t",{"$f":"VLOOKUP(D302,'Input Wonen'!$D$13:$H$151,2,FALSE)","v":"Dakvloer: breedplaatvloer, 270mm incl. druklaag"},{"$f":"VLOOKUP(D302,'Input Wonen'!$D$13:$H$151,3,FALSE)","v":"Breedplaatvloer; incl. druklaag "},null,"DA02.HNN",{"$f":"IFERROR(VLOOKUP(H302,'Input Wonen'!$J$13:$N$151,COLUMNS('Input Wonen'!J:K),FALSE),\"\")","v":"Dakvloer: breedplaatvloer, 270mm incl. druklaag"},{"$f":"IFERROR(VLOOKUP(H302,'Input Wonen'!$J$13:$N$151,COLUMNS('Input Wonen'!J:L),FALSE),\"\")","v":"Breedplaatvloer; incl. druklaag (UMC)"},null,"DA02.E",{"$f":"IFERROR(VLOOKUP(L302,'Input Wonen'!$P$13:$T$151,COLUMNS('Input Wonen'!P:Q),FALSE),\"\")","v":"Dakconstructie, plat dak"},{"$f":"IFERROR(VLOOKUP(L302,'Input Wonen'!$P$13:$T$151,COLUMNS('Input Wonen'!P:R),FALSE),\"\")","v":"CLT excl. isolatie"}]
[null,null,null,"DA05.t",{"$f":"VLOOKUP(D303,'Input Wonen'!$D$13:$H$151,2,FALSE)","v":"Isolatielagen; plat dak; Rc=6,3"},{"$f":"VLOOKUP(D303,'Input Wonen'!$D$13:$H$151,3,FALSE)","v":"XPS"},null,"DA05.HNN",{"$f":"IFERROR(VLOOKUP(H303,'Input Wonen'!$J$13:$N$151,COLUMNS('Input Wonen'!J:K),FALSE),\"\")","v":"Isolatielagen; plat dak; Rc=6,3"},{"$f":"IFERROR(VLOOKUP(H303,'Input Wonen'!$J$13:$N$151,COLUMNS('Input Wonen'!J:L),FALSE),\"\")","v":"Drukvaste houtvezelisolatie"},null,"DA05.E",{"$f":"IFERROR(VLOOKUP(L303,'Input Wonen'!$P$13:$T$151,COLUMNS('Input Wonen'!P:Q),FALSE),\"\")","v":"Isolatielagen; plat dak; Rc=6,3"},{"$f":"IFERROR(VLOOKUP(L303,'Input Wonen'!$P$13:$T$151,COLUMNS('Input Wonen'!P:R),FALSE),\"\")","v":"Drukvaste houtvezelisolatie"}]
[null,null,null,"DA09.t",{"$f":"VLOOKUP(D304,'Input Wonen'!$D$13:$H$151,2,FALSE)","v":"Dakbedekking"},{"$f":"VLOOKUP(D304,'Input Wonen'!$D$13:$H$151,3,FALSE)","v":"Bitumen, gemod. eenlaags 4,3mm"},null,"DA09.HNN",{"$f":"IFERROR(VLOOKUP(H304,'Input Wonen'!$J$13:$N$151,COLUMNS('Input Wonen'!J:K),FALSE),\"\")","v":"Dakbedekking"},{"$f":"IFERROR(VLOOKUP(H304,'Input Wonen'!$J$13:$N$151,COLUMNS('Input Wonen'!J:L),FALSE),\"\")","v":"EPDM losmaakbare dakbedekking"},null,"DA09.E",{"$f":"IFERROR(VLOOKUP(L304,'Input Wonen'!$P$13:$T$151,COLUMNS('Input Wonen'!P:Q),FALSE),\"\")","v":"Dakbedekking"},{"$f":"IFERROR(VLOOKUP(L304,'Input Wonen'!$P$13:$T$151,COLUMNS('Input Wonen'!P:R),FALSE),\"\")","v":"EPDM losmaakbare dakbedekking"}]
[null,null,null,"DA07.t",{"$f":"VLOOKUP(D305,'Input Wonen'!$D$13:$H$151,2,FALSE)","v":"Dakafwerking"},{"$f":"VLOOKUP(D305,'Input Wonen'!$D$13:$H$151,3,FALSE)","v":"Grind"},null,"DA07.HNN",{"$f":"IFERROR(VLOOKUP(H305,'Input Wonen'!$J$13:$N$151,COLUMNS('Input Wonen'!J:K),FALSE),\"\")","v":"Dakafwerking"},{"$f":"IFERROR(VLOOKUP(H305,'Input Wonen'!$J$13:$N$151,COLUMNS('Input Wonen'!J:L),FALSE),\"\")","v":"Grind"},null,"DA07.E",{"$f":"IFERROR(VLOOKUP(L305,'Input Wonen'!$P$13:$T$151,COLUMNS('Input Wonen'!P:Q),FALSE),\"\")","v":"Dakafwerking"},{"$f":"IFERROR(VLOOKUP(L305,'Input Wonen'!$P$13:$T$151,COLUMNS('Input Wonen'!P:R),FALSE),\"\")","v":"Grind"}]
[null,null,null,"DA11.t",{"$f":"VLOOKUP(D306,'Input Wonen'!$D$13:$H$151,2,FALSE)","v":"Waterkeringen"},{"$f":"VLOOKUP(D306,'Input Wonen'!$D$13:$H$151,3,FALSE)","v":"EPDM aluminium versterkt"},null,"DA11.HNN",{"$f":"IFERROR(VLOOKUP(H306,'Input Wonen'!$J$13:$N$151,COLUMNS('Input Wonen'!J:K),FALSE),\"\")","v":"Waterkeringen"},{"$f":"IFERROR(VLOOKUP(H306,'Input Wonen'!$J$13:$N$151,COLUMNS('Input Wonen'!J:L),FALSE),\"\")","v":"EPDM aluminium versterkt"},null,"DA11.E",{"$f":"IFERROR(VLOOKUP(L306,'Input Wonen'!$P$13:$T$151,COLUMNS('Input Wonen'!P:Q),FALSE),\"\")","v":"Waterkeringen"},{"$f":"IFERROR(VLOOKUP(L306,'Input Wonen'!$P$13:$T$151,COLUMNS('Input Wonen'!P:R),FALSE),\"\")","v":"EPDM aluminium versterkt"}]
[null,null,null,null,"Binnenwanden",null,null,null,"Binnenwanden",null,null,null,"Binnenwanden"]
[null,null,null,"BI01.t",{"$f":"VLOOKUP(D308,'Input Wonen'!$D$13:$H$151,2,FALSE)","v":"Dragende binnenwanden, 250mm; "},{"$f":"VLOOKUP(D308,'Input Wonen'!$D$13:$H$151,3,FALSE)","v":"I.h.w.g. beton"},null,"BI01.HNN",{"$f":"IFERROR(VLOOKUP(H308,'Input Wonen'!$J$13:$N$151,COLUMNS('Input Wonen'!J:K),FALSE),\"\")","v":"Dragende binnenwanden, 250mm; "},{"$f":"IFERROR(VLOOKUP(H308,'Input Wonen'!$J$13:$N$151,COLUMNS('Input Wonen'!J:L),FALSE),\"\")","v":"I.h.w.g. beton (UMC)"},null,"GE27.E",{"$f":"IFERROR(VLOOKUP(L308,'Input Wonen'!$P$13:$T$151,COLUMNS('Input Wonen'!P:Q),FALSE),\"\")","v":"Dragende binnenwanden"},{"$f":"IFERROR(VLOOKUP(L308,'Input Wonen'!$P$13:$T$151,COLUMNS('Input Wonen'!P:R),FALSE),\"\")","v":"CLT wanden"}]
[null,null,null,"BI04.t",{"$f":"VLOOKUP(D309,'Input Wonen'!$D$13:$H$151,2,FALSE)","v":"Wandtegelwerk badkamer, toilet en keuken"},{"$f":"VLOOKUP(D309,'Input Wonen'!$D$13:$H$151,3,FALSE)","v":"Keramische tegels; geglazuurd/gelijmd"},null,"BI04.HNN",{"$f":"IFERROR(VLOOKUP(H309,'Input Wonen'!$J$13:$N$151,COLUMNS('Input Wonen'!J:K),FALSE),\"\")","v":"Wandtegelwerk badkamer, toilet en keuken"},{"$f":"IFERROR(VLOOKUP(H309,'Input Wonen'!$J$13:$N$151,COLUMNS('Input Wonen'!J:L),FALSE),\"\")","v":"Mosa C2C wandtegels"},null,"BI04.E",{"$f":"IFERROR(VLOOKUP(L309,'Input Wonen'!$P$13:$T$151,COLUMNS('Input Wonen'!P:Q),FALSE),\"\")","v":"Wandtegelwerk badkamer, toilet en keuken"},{"$f":"IFERROR(VLOOKUP(L309,'Input Wonen'!$P$13:$T$151,COLUMNS('Input Wonen'!P:R),FALSE),\"\")","v":"Gerecycled PET i.c.m. Quartz"}]
[null,null,null,"BI05.t",{"$f":"VLOOKUP(D310,'Input Wonen'!$D$13:$H$151,2,FALSE)","v":"Binnenwanden, 70mm"},{"$f":"VLOOKUP(D310,'Input Wonen'!$D$13:$H$151,3,FALSE)","v":"Gipsblokken, normale dichtheid"},null,"BI05.HNN",{"$f":"IFERROR(VLOOKUP(H310,'Input Wonen'!$J$13:$N$151,COLUMNS('Input Wonen'!J:K),FALSE),\"\")","v":"Binnenwanden, 70mm"},{"$f":"IFERROR(VLOOKUP(H310,'Input Wonen'!$J$13:$N$151,COLUMNS('Input Wonen'!J:L),FALSE),\"\")","v":"Faay volpaneel"},null,"BI05.E",{"$f":"IFERROR(VLOOKUP(L310,'Input Wonen'!$P$13:$T$151,COLUMNS('Input Wonen'!P:Q),FALSE),\"\")","v":"Binnenwanden, 70mm"},{"$f":"IFERROR(VLOOKUP(L310,'Input Wonen'!$P$13:$T$151,COLUMNS('Input Wonen'!P:R),FALSE),\"\")","v":"Faay volpaneel"}]
[null,null,null,"BI03.t",{"$f":"VLOOKUP(D311,'Input Wonen'!$D$13:$H$151,2,FALSE)","v":"Binnenwanden, 100mm"},{"$f":"VLOOKUP(D311,'Input Wonen'!$D$13:$H$151,3,FALSE)","v":"Kalkzandsteen lijmblokken, 100mm"},null,"BI03.HNN",{"$f":"IFERROR(VLOOKUP(H311,'Input Wonen'!$J$13:$N$151,COLUMNS('Input Wonen'!J:K),FALSE),\"\")","v":"Binnenwanden, 100mm"},{"$f":"IFERROR(VLOOKUP(H311,'Input Wonen'!$J$13:$N$151,COLUMNS('Input Wonen'!J:L),FALSE),\"\")","v":"Faay volpaneel"},null,"BI03.E",{"$f":"IFERROR(VLOOKUP(L311,'Input Wonen'!$P$13:$T$151,COLUMNS('Input Wonen'!P:Q),FALSE),\"\")","v":"Binnenwanden, 100mm"},{"$f":"IFERROR(VLOOKUP(L311,'Input Wonen'!$P$13:$T$151,COLUMNS('Input Wonen'!P:R),FALSE),\"\")","v":"Faay volpaneel"}]
[null,null,null,"BI12.t",{"$f":"VLOOKUP(D312,'Input Wonen'!$D$13:$H$151,2,FALSE)","v":"Binnenkozijnen, incl. deuren"},{"$f":"VLOOKUP(D312,'Input Wonen'!$D$13:$H$151,3,FALSE)","v":"Europees naaldhout, geschilderd"},null,"BI12.HNN",{"$f":"IFERROR(VLOOKUP(H312,'Input Wonen'!$J$13:$N$151,COLUMNS('Input Wonen'!J:K),FALSE),\"\")","v":"Binnenkozijnen, incl. deuren"},{"$f":"IFERROR(VLOOKUP(H312,'Input Wonen'!$J$13:$N$151,COLUMNS('Input Wonen'!J:L),FALSE),\"\")","v":"Europees naaldhout, geschilderd"},null,"BI12.E",{"$f":"IFERROR(VLOOKUP(L312,'Input Wonen'!$P$13:$T$151,COLUMNS('Input Wonen'!P:Q),FALSE),\"\")","v":"Binnenkozijnen, incl. deuren"},{"$f":"IFERROR(VLOOKUP(L312,'Input Wonen'!$P$13:$T$151,COLUMNS('Input Wonen'!P:R),FALSE),\"\")","v":"Europees naaldhout, geschilderd"}]
[null,null,null,"BI11.t",{"$f":"VLOOKUP(D313,'Input Wonen'!$D$13:$H$151,2,FALSE)","v":"Binnenkozijnen"},{"$f":"VLOOKUP(D313,'Input Wonen'!$D$13:$H$151,3,FALSE)","v":"Staal; verzinkt+gemoffeld"},null,"BI11.HNN",{"$f":"IFERROR(VLOOKUP(H313,'Input Wonen'!$J$13:$N$151,COLUMNS('Input Wonen'!J:K),FALSE),\"\")","v":"Binnenkozijnen"},{"$f":"IFERROR(VLOOKUP(H313,'Input Wonen'!$J$13:$N$151,COLUMNS('Input Wonen'!J:L),FALSE),\"\")","v":"Europees naaldhout, geschilderd"},null,"BI11.E",{"$f":"IFERROR(VLOOKUP(L313,'Input Wonen'!$P$13:$T$151,COLUMNS('Input Wonen'!P:Q),FALSE),\"\")","v":"Binnenkozijnen"},{"$f":"IFERROR(VLOOKUP(L313,'Input Wonen'!$P$13:$T$151,COLUMNS('Input Wonen'!P:R),FALSE),\"\")","v":"Europees naaldhout, geschilderd"}]
[null,null,null,"BI08.t",{"$f":"VLOOKUP(D314,'Input Wonen'!$D$13:$H$151,2,FALSE)","v":"Binnendeuren"},{"$f":"VLOOKUP(D314,'Input Wonen'!$D$13:$H$151,3,FALSE)","v":"Honingraat; vlakke binnendeur"},null,"BI08.HNN",{"$f":"IFERROR(VLOOKUP(H314,'Input Wonen'!$J$13:$N$151,COLUMNS('Input Wonen'!J:K),FALSE),\"\")","v":"Binnendeuren"},{"$f":"IFERROR(VLOOKUP(H314,'Input Wonen'!$J$13:$N$151,COLUMNS('Input Wonen'!J:L),FALSE),\"\")","v":"Honingraat; vlakke binnendeur"},null,"BI08.E",{"$f":"IFERROR(VLOOKUP(L314,'Input Wonen'!$P$13:$T$151,COLUMNS('Input Wonen'!P:Q),FALSE),\"\")","v":"Binnendeuren"},{"$f":"IFERROR(VLOOKUP(L314,'Input Wonen'!$P$13:$T$151,COLUMNS('Input Wonen'!P:R),FALSE),\"\")","v":"Honingraat; vlakke binnendeur"}]
[null,null,null,"BI10.t",{"$f":"VLOOKUP(D315,'Input Wonen'!$D$13:$H$151,2,FALSE)","v":"Binnendorpels"},{"$f":"VLOOKUP(D315,'Input Wonen'!$D$13:$H$151,3,FALSE)","v":"Gegoten composietsteen"},null,"BI10.HNN",{"$f":"IFERROR(VLOOKUP(H315,'Input Wonen'!$J$13:$N$151,COLUMNS('Input Wonen'!J:K),FALSE),\"\")","v":"Binnendorpels"},{"$f":"IFERROR(VLOOKUP(H315,'Input Wonen'!$J$13:$N$151,COLUMNS('Input Wonen'!J:L),FALSE),\"\")","v":"Kunststeen"},null,"BI10.E",{"$f":"IFERROR(VLOOKUP(L315,'Input Wonen'!$P$13:$T$151,COLUMNS('Input Wonen'!P:Q),FALSE),\"\")","v":"Binnendorpels"},{"$f":"IFERROR(VLOOKUP(L315,'Input Wonen'!$P$13:$T$151,COLUMNS('Input Wonen'!P:R),FALSE),\"\")","v":"Kunststeen"}]
[null,null,null,null,"Klimaatinstallaties",null,null,null,"Klimaatinstallaties",null,null,null,"Klimaatinstallaties"]
[null,null,null,"KL02.t",{"$f":"VLOOKUP(D317,'Input Wonen'!$D$13:$H$151,2,FALSE)","v":"Warmtedistributiesysteem"},{"$f":"VLOOKUP(D317,'Input Wonen'!$D$13:$H$151,3,FALSE)","v":"CV-leidingen incl. koppelingen + verdeling"},null,"KL02.HNN",{"$f":"IFERROR(VLOOKUP(H317,'Input Wonen'!$J$13:$N$151,COLUMNS('Input Wonen'!J:K),FALSE),\"\")","v":"Warmtedistributiesysteem"},{"$f":"IFERROR(VLOOKUP(H317,'Input Wonen'!$J$13:$N$151,COLUMNS('Input Wonen'!J:L),FALSE),\"\")","v":"CV-leidingen incl. koppelingen + verdeling"},null,"KL02.E",{"$f":"IFERROR(VLOOKUP(L317,'Input Wonen'!$P$13:$T$151,COLUMNS('Input Wonen'!P:Q),FALSE),\"\")","v":"Warmtedistributiesysteem"},{"$f":"IFERROR(VLOOKUP(L317,'Input Wonen'!$P$13:$T$151,COLUMNS('Input Wonen'!P:R),FALSE),\"\")","v":"CV-leidingen incl. koppelingen + verdeling"}]
[null,null,null,"KL07.t",{"$f":"VLOOKUP(D318,'Input Wonen'!$D$13:$H$151,2,FALSE)","v":"Warmtapwaterinstallatie"},{"$f":"VLOOKUP(D318,'Input Wonen'!$D$13:$H$151,3,FALSE)","v":"Elektrische boiler; CW:4-6 120 liter"},null,"KL07.HNN",{"$f":"IFERROR(VLOOKUP(H318,'Input Wonen'!$J$13:$N$151,COLUMNS('Input Wonen'!J:K),FALSE),\"\")","v":"Warmtapwaterinstallatie"},{"$f":"IFERROR(VLOOKUP(H318,'Input Wonen'!$J$13:$N$151,COLUMNS('Input Wonen'!J:L),FALSE),\"\")","v":"Elektrische boiler; CW:4-6 120 liter"},null,"KL07.E",{"$f":"IFERROR(VLOOKUP(L318,'Input Wonen'!$P$13:$T$151,COLUMNS('Input Wonen'!P:Q),FALSE),\"\")","v":"Warmtapwaterinstallatie"},{"$f":"IFERROR(VLOOKUP(L318,'Input Wonen'!$P$13:$T$151,COLUMNS('Input Wonen'!P:R),FALSE),\"\")","v":"Elektrische boiler; CW:4-6 120 liter"}]
[null,null,null,"KL03.t",{"$f":"VLOOKUP(D319,'Input Wonen'!$D$13:$H$151,2,FALSE)","v":"Warmteafgiftesysteem"},{"$f":"VLOOKUP(D319,'Input Wonen'!$D$13:$H$151,3,FALSE)","v":"Vloerverwarming 95 W/m2"},null,"KL03.HNN",{"$f":"IFERROR(VLOOKUP(H319,'Input Wonen'!$J$13:$N$151,COLUMNS('Input Wonen'!J:K),FALSE),\"\")","v":"Warmteafgiftesysteem"},{"$f":"IFERROR(VLOOKUP(H319,'Input Wonen'!$J$13:$N$151,COLUMNS('Input Wonen'!J:L),FALSE),\"\")","v":"Vloerverwarming 95 W/m2"},null,"KL03.E",{"$f":"IFERROR(VLOOKUP(L319,'Input Wonen'!$P$13:$T$151,COLUMNS('Input Wonen'!P:Q),FALSE),\"\")","v":"Warmteafgiftesysteem"},{"$f":"IFERROR(VLOOKUP(L319,'Input Wonen'!$P$13:$T$151,COLUMNS('Input Wonen'!P:R),FALSE),\"\")","v":"Vloerverwarming 95 W/m2 "}]
[null,null,null,"KL01.t",{"$f":"VLOOKUP(D320,'Input Wonen'!$D$13:$H$151,2,FALSE)","v":"Warmteopwekkinginstallatie"},{"$f":"VLOOKUP(D320,'Input Wonen'!$D$13:$H$151,3,FALSE)","v":"Warmtepomp luchtwater 10kW "},null,"KL01.HNN",{"$f":"IFERROR(VLOOKUP(H320,'Input Wonen'!$J$13:$N$151,COLUMNS('Input Wonen'!J:K),FALSE),\"\")","v":"Warmteopwekkinginstallatie"},{"$f":"IFERROR(VLOOKUP(H320,'Input Wonen'!$J$13:$N$151,COLUMNS('Input Wonen'!J:L),FALSE),\"\")","v":"Warmtepomp luchtwater 10kW "},null,"KL01.E",{"$f":"IFERROR(VLOOKUP(L320,'Input Wonen'!$P$13:$T$151,COLUMNS('Input Wonen'!P:Q),FALSE),\"\")","v":"Warmteopwekkinginstallatie"},{"$f":"IFERROR(VLOOKUP(L320,'Input Wonen'!$P$13:$T$151,COLUMNS('Input Wonen'!P:R),FALSE),\"\")","v":"Warmtepomp luchtwater 10kW "}]
[null,null,null,"KL05.t",{"$f":"VLOOKUP(D321,'Input Wonen'!$D$13:$H$151,2,FALSE)","v":"Luchtdistributiesysteem"},{"$f":"VLOOKUP(D321,'Input Wonen'!$D$13:$H$151,3,FALSE)","v":"VLA ventilatiesysteem, type D met centrale wtw; W-bouw, individueel"},null,"KL05.HNN",{"$f":"IFERROR(VLOOKUP(H321,'Input Wonen'!$J$13:$N$151,COLUMNS('Input Wonen'!J:K),FALSE),\"\")","v":"Luchtdistributiesysteem"},{"$f":"IFERROR(VLOOKUP(H321,'Input Wonen'!$J$13:$N$151,COLUMNS('Input Wonen'!J:L),FALSE),\"\")","v":"VLA ventilatiesysteem, type D met centrale wtw; W-bouw, individueel"},null,"KL05.E",{"$f":"IFERROR(VLOOKUP(L321,'Input Wonen'!$P$13:$T$151,COLUMNS('Input Wonen'!P:Q),FALSE),\"\")","v":"Luchtdistributiesysteem"},{"$f":"IFERROR(VLOOKUP(L321,'Input Wonen'!$P$13:$T$151,COLUMNS('Input Wonen'!P:R),FALSE),\"\")","v":"VLA ventilatiesysteem, type D met centrale wtw; W-bouw, individueel"}]
[null,null,null,null,"Elektrische installaties",null,null,null,"Elektrische installaties",null,null,null,"Elektrische installaties"]
[null,null,null,"EL01.t",{"$f":"VLOOKUP(D323,'Input Wonen'!$D$13:$H$151,2,FALSE)","v":"Elektriciteitsleidingen"},{"$f":"VLOOKUP(D323,'Input Wonen'!$D$13:$H$151,3,FALSE)","v":"Geïsoleerde installatiedraad + mantelbuis"},null,"EL01.HNN",{"$f":"IFERROR(VLOOKUP(H323,'Input Wonen'!$J$13:$N$151,COLUMNS('Input Wonen'!J:K),FALSE),\"\")","v":"Elektriciteitsleidingen"},{"$f":"IFERROR(VLOOKUP(H323,'Input Wonen'!$J$13:$N$151,COLUMNS('Input Wonen'!J:L),FALSE),\"\")","v":"Geïsoleerde installatiedraad + mantelbuis"},null,"EL01.E",{"$f":"IFERROR(VLOOKUP(L323,'Input Wonen'!$P$13:$T$151,COLUMNS('Input Wonen'!P:Q),FALSE),\"\")","v":"Elektriciteitsleidingen"},{"$f":"IFERROR(VLOOKUP(L323,'Input Wonen'!$P$13:$T$151,COLUMNS('Input Wonen'!P:R),FALSE),\"\")","v":"Geïsoleerde installatiedraad + mantelbuis"}]
[null,null,null,"EL03.t",{"$f":"VLOOKUP(D324,'Input Wonen'!$D$13:$H$151,2,FALSE)","v":"Pv-panelen, plat dak"},{"$f":"VLOOKUP(D324,'Input Wonen'!$D$13:$H$151,3,FALSE)","v":"Mono-Si; incl. inverter+kabels"},null,"EL03.HNN",{"$f":"IFERROR(VLOOKUP(H324,'Input Wonen'!$J$13:$N$151,COLUMNS('Input Wonen'!J:K),FALSE),\"\")","v":"Pv-panelen, plat dak"},{"$f":"IFERROR(VLOOKUP(H324,'Input Wonen'!$J$13:$N$151,COLUMNS('Input Wonen'!J:L),FALSE),\"\")","v":"Exasun Xglass"},null,"EL03.E",{"$f":"IFERROR(VLOOKUP(L324,'Input Wonen'!$P$13:$T$151,COLUMNS('Input Wonen'!P:Q),FALSE),\"\")","v":"Pv-panelen, plat dak"},{"$f":"IFERROR(VLOOKUP(L324,'Input Wonen'!$P$13:$T$151,COLUMNS('Input Wonen'!P:R),FALSE),\"\")","v":"Exasun Xglass"}]
[null,null,null,"EL04.t",{"$f":"VLOOKUP(D325,'Input Wonen'!$D$13:$H$151,2,FALSE)","v":"Verlichting"},{"$f":"VLOOKUP(D325,'Input Wonen'!$D$13:$H$151,3,FALSE)","v":"LED-120cm"},null,"EL04.HNN",{"$f":"IFERROR(VLOOKUP(H325,'Input Wonen'!$J$13:$N$151,COLUMNS('Input Wonen'!J:K),FALSE),\"\")","v":"Verlichting"},{"$f":"IFERROR(VLOOKUP(H325,'Input Wonen'!$J$13:$N$151,COLUMNS('Input Wonen'!J:L),FALSE),\"\")","v":"LED-120cm"},null,"EL04.E",{"$f":"IFERROR(VLOOKUP(L325,'Input Wonen'!$P$13:$T$151,COLUMNS('Input Wonen'!P:Q),FALSE),\"\")","v":"Verlichting"},{"$f":"IFERROR(VLOOKUP(L325,'Input Wonen'!$P$13:$T$151,COLUMNS('Input Wonen'!P:R),FALSE),\"\")","v":"LED-120cm"}]
[null,null,null,null,"Toe- en afvoeren",null,null,null,"Toe- en afvoeren",null,null,null,"Toe- en afvoeren"]
[null,null,null,"TO01.t",{"$f":"VLOOKUP(D327,'Input Wonen'!$D$13:$H$151,2,FALSE)","v":"Waterleidingen"},{"$f":"VLOOKUP(D327,'Input Wonen'!$D$13:$H$151,3,FALSE)","v":"Polyetheen; leiding+mantelbuis"},null,"TO01.HNN",{"$f":"IFERROR(VLOOKUP(H327,'Input Wonen'!$J$13:$N$151,COLUMNS('Input Wonen'!J:K),FALSE),\"\")","v":"Waterleidingen"},{"$f":"IFERROR(VLOOKUP(H327,'Input Wonen'!$J$13:$N$151,COLUMNS('Input Wonen'!J:L),FALSE),\"\")","v":"Polyetheen"},null,"TO01.E",{"$f":"IFERROR(VLOOKUP(L327,'Input Wonen'!$P$13:$T$151,COLUMNS('Input Wonen'!P:Q),FALSE),\"\")","v":"Waterleidingen"},{"$f":"IFERROR(VLOOKUP(L327,'Input Wonen'!$P$13:$T$151,COLUMNS('Input Wonen'!P:R),FALSE),\"\")","v":"Polyetheen"}]
[null,null,null,"TO02.t",{"$f":"VLOOKUP(D328,'Input Wonen'!$D$13:$H$151,2,FALSE)","v":"Buitenriolering kavel"},{"$f":"VLOOKUP(D328,'Input Wonen'!$D$13:$H$151,3,FALSE)","v":"PVC"},null,"TO02.HNN",{"$f":"IFERROR(VLOOKUP(H328,'Input Wonen'!$J$13:$N$151,COLUMNS('Input Wonen'!J:K),FALSE),\"\")","v":"Buitenriolering"},{"$f":"IFERROR(VLOOKUP(H328,'Input Wonen'!$J$13:$N$151,COLUMNS('Input Wonen'!J:L),FALSE),\"\")","v":"Gerecycled PVC (Pipelife)"},null,"TO02.E",{"$f":"IFERROR(VLOOKUP(L328,'Input Wonen'!$P$13:$T$151,COLUMNS('Input Wonen'!P:Q),FALSE),\"\")","v":"Buitenriolering"},{"$f":"IFERROR(VLOOKUP(L328,'Input Wonen'!$P$13:$T$151,COLUMNS('Input Wonen'!P:R),FALSE),\"\")","v":"Gerecycled PVC (Pipelife)"}]
[null,null,null,"TO04.t",{"$f":"VLOOKUP(D329,'Input Wonen'!$D$13:$H$151,2,FALSE)","v":"Hemelwaterafvoer"},{"$f":"VLOOKUP(D329,'Input Wonen'!$D$13:$H$151,3,FALSE)","v":"PVC"},null,"TO04.HNN",{"$f":"IFERROR(VLOOKUP(H329,'Input Wonen'!$J$13:$N$151,COLUMNS('Input Wonen'!J:K),FALSE),\"\")","v":"Hemelwaterafvoer"},{"$f":"IFERROR(VLOOKUP(H329,'Input Wonen'!$J$13:$N$151,COLUMNS('Input Wonen'!J:L),FALSE),\"\")","v":"Gerecycled PVC (Pipelife)"},null,"TO04.E",{"$f":"IFERROR(VLOOKUP(L329,'Input Wonen'!$P$13:$T$151,COLUMNS('Input Wonen'!P:Q),FALSE),\"\")","v":"Hemelwaterafvoer"},{"$f":"IFERROR(VLOOKUP(L329,'Input Wonen'!$P$13:$T$151,COLUMNS('Input Wonen'!P:R),FALSE),\"\")","v":"Gerecycled PVC (Pipelife)"}]
[null,null,null,"TO03.t",{"$f":"VLOOKUP(D330,'Input Wonen'!$D$13:$H$151,2,FALSE)","v":"Binnenriolering"},{"$f":"VLOOKUP(D330,'Input Wonen'!$D$13:$H$151,3,FALSE)","v":"PVC"},null,"TO03.HNN",{"$f":"IFERROR(VLOOKUP(H330,'Input Wonen'!$J$13:$N$151,COLUMNS('Input Wonen'!J:K),FALSE),\"\")","v":"Binnenriolering"},{"$f":"IFERROR(VLOOKUP(H330,'Input Wonen'!$J$13:$N$151,COLUMNS('Input Wonen'!J:L),FALSE),\"\")","v":"Gerecycled PVC (Pipelife)"},null,"TO03.E",{"$f":"IFERROR(VLOOKUP(L330,'Input Wonen'!$P$13:$T$151,COLUMNS('Input Wonen'!P:Q),FALSE),\"\")","v":"Binnenriolering"},{"$f":"IFERROR(VLOOKUP(L330,'Input Wonen'!$P$13:$T$151,COLUMNS('Input Wonen'!P:R),FALSE),\"\")","v":"Gerecycled PVC (Pipelife)"}]
[null,null,null,null,"Verkeersruimte",null,null,null,"Verkeersruimte",null,null,null,"Verkeersruimte"]
[null,null,null,"VE02.t",{"$f":"VLOOKUP(D332,'Input Wonen'!$D$13:$H$151,2,FALSE)","v":"Centrale trap"},{"$f":"VLOOKUP(D332,'Input Wonen'!$D$13:$H$151,3,FALSE)","v":"Prefab beton"},null,"VE02.HNN",{"$f":"IFERROR(VLOOKUP(H332,'Input Wonen'!$J$13:$N$151,COLUMNS('Input Wonen'!J:K),FALSE),\"\")","v":"Centrale trap"},{"$f":"IFERROR(VLOOKUP(H332,'Input Wonen'!$J$13:$N$151,COLUMNS('Input Wonen'!J:L),FALSE),\"\")","v":"Prefab beton"},null,"VE02.E",{"$f":"IFERROR(VLOOKUP(L332,'Input Wonen'!$P$13:$T$151,COLUMNS('Input Wonen'!P:Q),FALSE),\"\")","v":"Centrale trap"},{"$f":"IFERROR(VLOOKUP(L332,'Input Wonen'!$P$13:$T$151,COLUMNS('Input Wonen'!P:R),FALSE),\"\")","v":"Prefab beton"}]
[null,null,null,"VE06.t",{"$f":"VLOOKUP(D333,'Input Wonen'!$D$13:$H$151,2,FALSE)","v":"Leuningen"},{"$f":"VLOOKUP(D333,'Input Wonen'!$D$13:$H$151,3,FALSE)","v":"Aluminium"},null,"VE06.HNN",{"$f":"IFERROR(VLOOKUP(H333,'Input Wonen'!$J$13:$N$151,COLUMNS('Input Wonen'!J:K),FALSE),\"\")","v":"Leuningen"},{"$f":"IFERROR(VLOOKUP(H333,'Input Wonen'!$J$13:$N$151,COLUMNS('Input Wonen'!J:L),FALSE),\"\")","v":"Aluminium"},null,"VE06.E",{"$f":"IFERROR(VLOOKUP(L333,'Input Wonen'!$P$13:$T$151,COLUMNS('Input Wonen'!P:Q),FALSE),\"\")","v":"Leuningen"},{"$f":"IFERROR(VLOOKUP(L333,'Input Wonen'!$P$13:$T$151,COLUMNS('Input Wonen'!P:R),FALSE),\"\")","v":"Aluminium"}]
[null,null,null,"VE04.t",{"$f":"VLOOKUP(D334,'Input Wonen'!$D$13:$H$151,2,FALSE)","v":"Balustrades"},{"$f":"VLOOKUP(D334,'Input Wonen'!$D$13:$H$151,3,FALSE)","v":"Aluminium; geanodiseerd"},null,"VE04.HNN",{"$f":"IFERROR(VLOOKUP(H334,'Input Wonen'!$J$13:$N$151,COLUMNS('Input Wonen'!J:K),FALSE),\"\")","v":"Balustrades"},{"$f":"IFERROR(VLOOKUP(H334,'Input Wonen'!$J$13:$N$151,COLUMNS('Input Wonen'!J:L),FALSE),\"\")","v":"Aluminium; geanodiseerd"},null,"VE04.E",{"$f":"IFERROR(VLOOKUP(L334,'Input Wonen'!$P$13:$T$151,COLUMNS('Input Wonen'!P:Q),FALSE),\"\")","v":"Balustrades"},{"$f":"IFERROR(VLOOKUP(L334,'Input Wonen'!$P$13:$T$151,COLUMNS('Input Wonen'!P:R),FALSE),\"\")","v":"Aluminium; geanodiseerd"}]
[null,null,null,"VE08.t",{"$f":"VLOOKUP(D335,'Input Wonen'!$D$13:$H$151,2,FALSE)","v":"Liftinstallatie"},{"$f":"VLOOKUP(D335,'Input Wonen'!$D$13:$H$151,3,FALSE)","v":"Staal"},null,"VE08.HNN",{"$f":"IFERROR(VLOOKUP(H335,'Input Wonen'!$J$13:$N$151,COLUMNS('Input Wonen'!J:K),FALSE),\"\")","v":"Liftinstallatie"},{"$f":"IFERROR(VLOOKUP(H335,'Input Wonen'!$J$13:$N$151,COLUMNS('Input Wonen'!J:L),FALSE),\"\")","v":"Staal"},null,"VE08.E",{"$f":"IFERROR(VLOOKUP(L335,'Input Wonen'!$P$13:$T$151,COLUMNS('Input Wonen'!P:Q),FALSE),\"\")","v":"Liftinstallatie"},{"$f":"IFERROR(VLOOKUP(L335,'Input Wonen'!$P$13:$T$151,COLUMNS('Input Wonen'!P:R),FALSE),\"\")","v":"Staal"}]
[null,null,null,null,"Vaste voorzieningen",null,null,null,"Vaste voorzieningen",null,null,null,"Vaste voorzieningen"]
[null,null,null,"VA01.t",{"$f":"VLOOKUP(D337,'Input Wonen'!$D$13:$H$151,2,FALSE)","v":"Toiletten; wandcloset + fontein"},{"$f":"VLOOKUP(D337,'Input Wonen'!$D$13:$H$151,3,FALSE)","v":"Porselein"},null,"VA01.HNN",{"$f":"IFERROR(VLOOKUP(H337,'Input Wonen'!$J$13:$N$151,COLUMNS('Input Wonen'!J:K),FALSE),\"\")","v":"Toiletten; wandcloset + fontein"},{"$f":"IFERROR(VLOOKUP(H337,'Input Wonen'!$J$13:$N$151,COLUMNS('Input Wonen'!J:L),FALSE),\"\")","v":"Porselein"},null,"VA01.E",{"$f":"IFERROR(VLOOKUP(L337,'Input Wonen'!$P$13:$T$151,COLUMNS('Input Wonen'!P:Q),FALSE),\"\")","v":"Toiletten; wandcloset + fontein"},{"$f":"IFERROR(VLOOKUP(L337,'Input Wonen'!$P$13:$T$151,COLUMNS('Input Wonen'!P:R),FALSE),\"\")","v":"Porselein"}]
[null,null,null,"VA02.t",{"$f":"VLOOKUP(D338,'Input Wonen'!$D$13:$H$151,2,FALSE)","v":"Wastafel"},{"$f":"VLOOKUP(D338,'Input Wonen'!$D$13:$H$151,3,FALSE)","v":"Keramisch"},null,"VA02.HNN",{"$f":"IFERROR(VLOOKUP(H338,'Input Wonen'!$J$13:$N$151,COLUMNS('Input Wonen'!J:K),FALSE),\"\")","v":"Wastafel"},{"$f":"IFERROR(VLOOKUP(H338,'Input Wonen'!$J$13:$N$151,COLUMNS('Input Wonen'!J:L),FALSE),\"\")","v":"Keramisch"},null,"VA02.E",{"$f":"IFERROR(VLOOKUP(L338,'Input Wonen'!$P$13:$T$151,COLUMNS('Input Wonen'!P:Q),FALSE),\"\")","v":"Wastafel"},{"$f":"IFERROR(VLOOKUP(L338,'Input Wonen'!$P$13:$T$151,COLUMNS('Input Wonen'!P:R),FALSE),\"\")","v":"Keramisch"}]
[null,null,null,"VA03.t",{"$f":"VLOOKUP(D339,'Input Wonen'!$D$13:$H$151,2,FALSE)","v":"Inloopdouche"},{"$f":"VLOOKUP(D339,'Input Wonen'!$D$13:$H$151,3,FALSE)","v":"Gipsblokken + tegels incl. rvs afvoergoot"},null,"VA03.HNN",{"$f":"IFERROR(VLOOKUP(H339,'Input Wonen'!$J$13:$N$151,COLUMNS('Input Wonen'!J:K),FALSE),\"\")","v":"Inloopdouche"},{"$f":"IFERROR(VLOOKUP(H339,'Input Wonen'!$J$13:$N$151,COLUMNS('Input Wonen'!J:L),FALSE),\"\")","v":"Gipsblokken + tegels incl. rvs afvoergoot"},null,"VA03.E",{"$f":"IFERROR(VLOOKUP(L339,'Input Wonen'!$P$13:$T$151,COLUMNS('Input Wonen'!P:Q),FALSE),\"\")","v":"Inloopdouche"},{"$f":"IFERROR(VLOOKUP(L339,'Input Wonen'!$P$13:$T$151,COLUMNS('Input Wonen'!P:R),FALSE),\"\")","v":"Gipsblokken + tegels incl. rvs afvoergoot"}]
[null,null,null,null,"Overige kosten",null,null,null,"Overige kosten",null,null,null,"Overige kosten"]
[null,null,null,"OK01.t",{"$f":"VLOOKUP(D341,'Input Wonen'!$D$13:$H$165,2,FALSE)","v":"Grondwerk, maatvoering, invoeren en sparingen"},{"$f":"VLOOKUP(D341,'Input Wonen'!$D$13:$H$165,3,FALSE)","v":0},null,"OK01.HNN",{"$f":"VLOOKUP(H341,'Input Wonen'!$J$13:$N$165,2,FALSE)","v":"Grondwerk, maatvoering, invoeren en sparingen"},{"$f":"IFERROR(VLOOKUP(H341,'Input Wonen'!$J$13:$N$165,COLUMNS('Input Wonen'!J:L),FALSE),\"\")","v":0},null,"OK01.E",{"$f":"VLOOKUP(H341,'Input Wonen'!$J$13:$N$165,2,FALSE)","v":"Grondwerk, maatvoering, invoeren en sparingen"}]
[null,null,null,"OK02.t",{"$f":"VLOOKUP(D342,'Input Wonen'!$D$13:$H$165,2,FALSE)","v":"Gevelsteiger"},{"$f":"VLOOKUP(D342,'Input Wonen'!$D$13:$H$165,3,FALSE)","v":0},null,"OK02.HNN",{"$f":"VLOOKUP(H342,'Input Wonen'!$J$13:$N$165,2,FALSE)","v":"Gevelsteiger"},{"$f":"VLOOKUP(H342,'Input Wonen'!$J$13:$N$165,3,FALSE)","v":0},null,"OK02.E",{"$f":"VLOOKUP(H342,'Input Wonen'!$J$13:$N$165,2,FALSE)","v":"Gevelsteiger"}]
[null,null,null,"OK03.t",{"$f":"VLOOKUP(D343,'Input Wonen'!$D$13:$H$165,2,FALSE)","v":"Dakvalbeveiliging en inplakken van doorvoeren"},{"$f":"VLOOKUP(D343,'Input Wonen'!$D$13:$H$165,3,FALSE)","v":"Enkel bij appartementen"},null,"OK03.HNN",{"$f":"VLOOKUP(H343,'Input Wonen'!$J$13:$N$165,2,FALSE)","v":"Dakvalbeveiliging en inplakken van doorvoeren"},{"$f":"VLOOKUP(H343,'Input Wonen'!$J$13:$N$165,3,FALSE)","v":"Enkel bij appartementen"},null,"OK03.E",{"$f":"VLOOKUP(H343,'Input Wonen'!$J$13:$N$165,2,FALSE)","v":"Dakvalbeveiliging en inplakken van doorvoeren"}]
[null,null,null,"OK04.t",{"$f":"VLOOKUP(D344,'Input Wonen'!$D$13:$H$165,2,FALSE)","v":"Afbouwwerkzaamheden (klein timmerwerk, schilderwerk)"},{"$f":"VLOOKUP(D344,'Input Wonen'!$D$13:$H$165,3,FALSE)","v":0},null,"OK04.HNN",{"$f":"VLOOKUP(H344,'Input Wonen'!$J$13:$N$165,2,FALSE)","v":"Afbouwwerkzaamheden (klein timmerwerk, schilderwerk)"},{"$f":"IFERROR(VLOOKUP(H344,'Input Wonen'!$J$13:$N$165,COLUMNS('Input Wonen'!J:L),FALSE),\"\")","v":0},null,"OK04.E",{"$f":"VLOOKUP(H344,'Input Wonen'!$J$13:$N$165,2,FALSE)","v":"Afbouwwerkzaamheden (klein timmerwerk, schilderwerk)"}]
[null,null,null,"OK05.t",{"$f":"VLOOKUP(D345,'Input Wonen'!$D$13:$H$165,2,FALSE)","v":"Bouwkundige voorzieningen ten behoeve van installaties"},{"$f":"VLOOKUP(D345,'Input Wonen'!$D$13:$H$165,3,FALSE)","v":0},null,"OK05.HNN",{"$f":"VLOOKUP(H345,'Input Wonen'!$J$13:$N$165,2,FALSE)","v":"Bouwkundige voorzieningen ten behoeve van installaties"},{"$f":"IFERROR(VLOOKUP(H345,'Input Wonen'!$J$13:$N$165,COLUMNS('Input Wonen'!J:L),FALSE),\"\")","v":0},null,"OK05.E",{"$f":"VLOOKUP(H345,'Input Wonen'!$J$13:$N$165,2,FALSE)","v":"Bouwkundige voorzieningen ten behoeve van installaties"}]
[null,null,null,"OK06b.t",{"$f":"VLOOKUP(D346,'Input Wonen'!$D$13:$H$165,2,FALSE)","v":"Installaties (E, W & klimaat) voor appartementen"},{"$f":"VLOOKUP(D346,'Input Wonen'!$D$13:$H$165,3,FALSE)","v":0},null,"OK06b.HNN",{"$f":"VLOOKUP(H346,'Input Wonen'!$J$13:$N$165,2,FALSE)","v":"Installaties (E, W & klimaat) voor appartementen"},{"$f":"VLOOKUP(H346,'Input Wonen'!$J$13:$N$165,3,FALSE)","v":0},null,"OK06b.E",{"$f":"VLOOKUP(H346,'Input Wonen'!$J$13:$N$165,2,FALSE)","v":"Installaties (E, W & klimaat) voor appartementen"}]
[]
[]
[null,null,null,null,"Traditioneel (RVO Referentieprojecten)",null,null,null,"Het Nieuwe Normaal",null,null,null,"Het Nieuwe Normaal ambitieus"]
[]
[null,null,null,null,"WONEN",null,null,null,"WONEN",null,null,null,"WONEN"]
[]
[]
[]
[]
[]
[]
[null,null,null,null,null,null,null,{"$f":"0.696-I358","v":0.61049999999999993},{"$f":"0.095-0.0095","v":8.5500000000000007E-2}]
[]
[]
[]
[]
[]
[]
[null,null,null,null,"Woonschijf",null,null,null,"Woonschijf",null,null,null,"Woonschijf"]
[null,null,null,null,"Element","Materialisatie",null,null,"Element","Materialisatie",null,null,"Element","Materialisatie"]
[]
[null,null,null,null,"Fundering",null,null,null,"Fundering",null,null,null,"Fundering"]
[null,null,null,"FU12.t",{"$f":"VLOOKUP(D369,'Input Wonen'!$D$13:$H$151,2,FALSE)","v":"Funderingspaal, ⌀ 350mm; l=15,0m"},{"$f":"VLOOKUP(D369,'Input Wonen'!$D$13:$H$151,3,FALSE)","v":"Schroefpaal; beton, in het werk gestort, C20/25,CEMIII; incl.wapening"},null,"FU12.HNN",{"$f":"IFERROR(VLOOKUP(H369,'Input Wonen'!$J$13:$N$151,COLUMNS('Input Wonen'!J:K),FALSE),\"\")","v":"Funderingspaal, ⌀ 350mm; l=15,0m"},{"$f":"IFERROR(VLOOKUP(H369,'Input Wonen'!$J$13:$N$151,COLUMNS('Input Wonen'!J:L),FALSE),\"\")","v":"Beton met 56% aan secundair aandeel (UMC)"},null,"FU12.E",{"$f":"IFERROR(VLOOKUP(L369,'Input Wonen'!$P$13:$T$151,COLUMNS('Input Wonen'!P:Q),FALSE),\"\")","v":"Funderingspaal, ⌀ 350mm; l=15,0m"},{"$f":"IFERROR(VLOOKUP(L369,'Input Wonen'!$P$13:$T$151,COLUMNS('Input Wonen'!P:R),FALSE),\"\")","v":"Beton met 56% aan secundair aandeel (UMC)"}]
[null,null,null,"FU09.t",{"$f":"VLOOKUP(D370,'Input Wonen'!$D$13:$H$151,2,FALSE)","v":"Funderingsbalken, 400x500mm"},{"$f":"VLOOKUP(D370,'Input Wonen'!$D$13:$H$151,3,FALSE)","v":"In het werk gestort"},null,"FU09.HNN",{"$f":"IFERROR(VLOOKUP(H370,'Input Wonen'!$J$13:$N$151,COLUMNS('Input Wonen'!J:K),FALSE),\"\")","v":"Funderingsbalken, 400x500mm"},{"$f":"IFERROR(VLOOKUP(H370,'Input Wonen'!$J$13:$N$151,COLUMNS('Input Wonen'!J:L),FALSE),\"\")","v":"Beton met 56% aan secundair aandeel (UMC)"},null,"FU09.E",{"$f":"IFERROR(VLOOKUP(L370,'Input Wonen'!$P$13:$T$151,COLUMNS('Input Wonen'!P:Q),FALSE),\"\")","v":"Funderingsbalken, 400x500mm"},{"$f":"IFERROR(VLOOKUP(L370,'Input Wonen'!$P$13:$T$151,COLUMNS('Input Wonen'!P:R),FALSE),\"\")","v":"Beton met 56% aan secundair aandeel (UMC)"}]
[null,null,null,"FU07.t",{"$f":"VLOOKUP(D371,'Input Wonen'!$D$13:$H$151,2,FALSE)","v":"Opgaand metselwerk"},{"$f":"VLOOKUP(D371,'Input Wonen'!$D$13:$H$151,3,FALSE)","v":"Kalkzandsteen lijmblokken, 100mm"},null,"FU07.HNN",{"$f":"IFERROR(VLOOKUP(H371,'Input Wonen'!$J$13:$N$151,COLUMNS('Input Wonen'!J:K),FALSE),\"\")","v":"Opgaand metselwerk"},{"$f":"IFERROR(VLOOKUP(H371,'Input Wonen'!$J$13:$N$151,COLUMNS('Input Wonen'!J:L),FALSE),\"\")","v":"Kalkzandsteen lijmblokken, 100mm"},null,"FU07.E",{"$f":"IFERROR(VLOOKUP(L371,'Input Wonen'!$P$13:$T$151,COLUMNS('Input Wonen'!P:Q),FALSE),\"\")","v":"Opgaand metselwerk"},{"$f":"IFERROR(VLOOKUP(L371,'Input Wonen'!$P$13:$T$151,COLUMNS('Input Wonen'!P:R),FALSE),\"\")","v":"Kalkzandsteen lijmblokken, 100mm"}]
[null,null,null,"FU05.t",{"$f":"VLOOKUP(D372,'Input Wonen'!$D$13:$H$151,2,FALSE)","v":"Bodemafsluiting, zand"},{"$f":"VLOOKUP(D372,'Input Wonen'!$D$13:$H$151,3,FALSE)","v":"Zand"},null,"FU05.HNN",{"$f":"IFERROR(VLOOKUP(H372,'Input Wonen'!$J$13:$N$151,COLUMNS('Input Wonen'!J:K),FALSE),\"\")","v":"Bodemafsluiting, 100 zand"},{"$f":"IFERROR(VLOOKUP(H372,'Input Wonen'!$J$13:$N$151,COLUMNS('Input Wonen'!J:L),FALSE),\"\")","v":"Zand"},null,"FU05.E",{"$f":"IFERROR(VLOOKUP(L372,'Input Wonen'!$P$13:$T$151,COLUMNS('Input Wonen'!P:Q),FALSE),\"\")","v":"Bodemafsluiting, 100 zand"},{"$f":"IFERROR(VLOOKUP(L372,'Input Wonen'!$P$13:$T$151,COLUMNS('Input Wonen'!P:R),FALSE),\"\")","v":"Zand"}]
[null,null,null,null,"Vloeren",null,null,null,"Vloeren",null,null,null,"Vloeren"]
[null,null,null,"VL11.t",{"$f":"VLOOKUP(D374,'Input Wonen'!$D$13:$H$151,2,FALSE)","v":"BG: kanaalplaatvloer, 200mm incl. isolatie (Rc=3,7)"},{"$f":"VLOOKUP(D374,'Input Wonen'!$D$13:$H$151,3,FALSE)","v":"Kanaalplaatvloer; prefab beton"},null,"VL11.HNN",{"$f":"IFERROR(VLOOKUP(H374,'Input Wonen'!$J$13:$N$151,COLUMNS('Input Wonen'!J:K),FALSE),\"\")","v":"BG: kanaalplaatvloer, 200mm incl. isolatie (Rc=3,7)"},{"$f":"IFERROR(VLOOKUP(H374,'Input Wonen'!$J$13:$N$151,COLUMNS('Input Wonen'!J:L),FALSE),\"\")","v":"Kanaalplaat, remontabel (28% recyclaat)"},null,"VL11.E",{"$f":"IFERROR(VLOOKUP(L374,'Input Wonen'!$P$13:$T$151,COLUMNS('Input Wonen'!P:Q),FALSE),\"\")","v":"BG: kanaalplaatvloer, 200mm incl. isolatie (Rc=3,7)"},{"$f":"IFERROR(VLOOKUP(L374,'Input Wonen'!$P$13:$T$151,COLUMNS('Input Wonen'!P:R),FALSE),\"\")","v":"Kanaalplaat, remontabel (28% recyclaat)"}]
[null,null,null,"VL07.t",{"$f":"VLOOKUP(D375,'Input Wonen'!$D$13:$H$151,2,FALSE)","v":"Dekvloeren, 60mm"},{"$f":"VLOOKUP(D375,'Input Wonen'!$D$13:$H$151,3,FALSE)","v":"Zandcement dekvloer"},null,"VL07.HNN",{"$f":"IFERROR(VLOOKUP(H375,'Input Wonen'!$J$13:$N$151,COLUMNS('Input Wonen'!J:K),FALSE),\"\")","v":"Dekvloeren, 60mm"},{"$f":"IFERROR(VLOOKUP(H375,'Input Wonen'!$J$13:$N$151,COLUMNS('Input Wonen'!J:L),FALSE),\"\")","v":"Fermacell honingraatvloer (op houten vloer)"},null,"VL07.E",{"$f":"IFERROR(VLOOKUP(L375,'Input Wonen'!$P$13:$T$151,COLUMNS('Input Wonen'!P:Q),FALSE),\"\")","v":"Dekvloeren, 60mm"},{"$f":"IFERROR(VLOOKUP(L375,'Input Wonen'!$P$13:$T$151,COLUMNS('Input Wonen'!P:R),FALSE),\"\")","v":"Fermacell honingraatvloer (op houten vloer)"}]
[null,null,null,"VL03.t",{"$f":"VLOOKUP(D376,'Input Wonen'!$D$13:$H$151,2,FALSE)","v":"Vloertegelwerk toilet"},{"$f":"VLOOKUP(D376,'Input Wonen'!$D$13:$H$151,3,FALSE)","v":"Keramische tegels, geglazuurd/gelijmd"},null,"VL03.HNN",{"$f":"IFERROR(VLOOKUP(H376,'Input Wonen'!$J$13:$N$151,COLUMNS('Input Wonen'!J:K),FALSE),\"\")","v":"Vloertegelwerk toilet"},{"$f":"IFERROR(VLOOKUP(H376,'Input Wonen'!$J$13:$N$151,COLUMNS('Input Wonen'!J:L),FALSE),\"\")","v":"Mosa C2C vloertegels"},null,"VL03.E",{"$f":"IFERROR(VLOOKUP(L376,'Input Wonen'!$P$13:$T$151,COLUMNS('Input Wonen'!P:Q),FALSE),\"\")","v":"Vloertegelwerk toilet"},{"$f":"IFERROR(VLOOKUP(L376,'Input Wonen'!$P$13:$T$151,COLUMNS('Input Wonen'!P:R),FALSE),\"\")","v":"Mosa C2C vloertegels (losmaakbaar)"}]
[null,null,null,"VL05.t",{"$f":"VLOOKUP(D377,'Input Wonen'!$D$13:$H$151,2,FALSE)","v":"VV: breedplaatvloer, 270mm incl. druklaag"},{"$f":"VLOOKUP(D377,'Input Wonen'!$D$13:$H$151,3,FALSE)","v":"Breedplaatvloer; incl. druklaag "},null,"VL05.HNN",{"$f":"IFERROR(VLOOKUP(H377,'Input Wonen'!$J$13:$N$151,COLUMNS('Input Wonen'!J:K),FALSE),\"\")","v":"VV: breedplaatvloer, 270mm incl. druklaag"},{"$f":"IFERROR(VLOOKUP(H377,'Input Wonen'!$J$13:$N$151,COLUMNS('Input Wonen'!J:L),FALSE),\"\")","v":"Breedplaatvloer; incl. druklaag (UMC)"},null,"VL05.E",{"$f":"IFERROR(VLOOKUP(L377,'Input Wonen'!$P$13:$T$151,COLUMNS('Input Wonen'!P:Q),FALSE),\"\")","v":"VV: CLT incl. dekvloer"},{"$f":"IFERROR(VLOOKUP(L377,'Input Wonen'!$P$13:$T$151,COLUMNS('Input Wonen'!P:R),FALSE),\"\")","v":"CLT verdiepingsvloer "}]
[null,null,null,"VL07.t",{"$f":"VLOOKUP(D378,'Input Wonen'!$D$13:$H$151,2,FALSE)","v":"Dekvloeren, 60mm"},{"$f":"VLOOKUP(D378,'Input Wonen'!$D$13:$H$151,3,FALSE)","v":"Zandcement dekvloer"},null,"VL07.HNN",{"$f":"IFERROR(VLOOKUP(H378,'Input Wonen'!$J$13:$N$151,COLUMNS('Input Wonen'!J:K),FALSE),\"\")","v":"Dekvloeren, 60mm"},{"$f":"IFERROR(VLOOKUP(H378,'Input Wonen'!$J$13:$N$151,COLUMNS('Input Wonen'!J:L),FALSE),\"\")","v":"Fermacell honingraatvloer (op houten vloer)"},null,"VL07.E",{"$f":"IFERROR(VLOOKUP(L378,'Input Wonen'!$P$13:$T$151,COLUMNS('Input Wonen'!P:Q),FALSE),\"\")","v":"Dekvloeren, 60mm"},{"$f":"IFERROR(VLOOKUP(L378,'Input Wonen'!$P$13:$T$151,COLUMNS('Input Wonen'!P:R),FALSE),\"\")","v":"Fermacell honingraatvloer (op houten vloer)"}]
[null,null,null,"VL04.t",{"$f":"VLOOKUP(D379,'Input Wonen'!$D$13:$H$151,2,FALSE)","v":"Vloertegelwerk badkamer"},{"$f":"VLOOKUP(D379,'Input Wonen'!$D$13:$H$151,3,FALSE)","v":"Keramische tegels, geglazuurd/gelijmd"},null,"VL04.HNN",{"$f":"IFERROR(VLOOKUP(H379,'Input Wonen'!$J$13:$N$151,COLUMNS('Input Wonen'!J:K),FALSE),\"\")","v":"Vloertegelwerk badkamer"},{"$f":"IFERROR(VLOOKUP(H379,'Input Wonen'!$J$13:$N$151,COLUMNS('Input Wonen'!J:L),FALSE),\"\")","v":"Mosa C2C vloertegels"},null,"VL04.E",{"$f":"IFERROR(VLOOKUP(L379,'Input Wonen'!$P$13:$T$151,COLUMNS('Input Wonen'!P:Q),FALSE),\"\")","v":"Vloertegelwerk badkamer"},{"$f":"IFERROR(VLOOKUP(L379,'Input Wonen'!$P$13:$T$151,COLUMNS('Input Wonen'!P:R),FALSE),\"\")","v":"Mosa C2C vloertegels (losmaakbaar)"}]
[null,null,null,"VL24.t",{"$f":"VLOOKUP(D380,'Input Wonen'!$D$13:$H$151,2,FALSE)","v":"Balustrades"},{"$f":"VLOOKUP(D380,'Input Wonen'!$D$13:$H$151,3,FALSE)","v":"Staal; gepoedercoat; spijlen"},null,"VL24.HNN",{"$f":"IFERROR(VLOOKUP(H380,'Input Wonen'!$J$13:$N$151,COLUMNS('Input Wonen'!J:K),FALSE),\"\")","v":"Balustrades"},{"$f":"IFERROR(VLOOKUP(H380,'Input Wonen'!$J$13:$N$151,COLUMNS('Input Wonen'!J:L),FALSE),\"\")","v":"Staal; gepoedercoat; spijlen"},null,"VL24.E",{"$f":"IFERROR(VLOOKUP(L380,'Input Wonen'!$P$13:$T$151,COLUMNS('Input Wonen'!P:Q),FALSE),\"\")","v":"Balustrades"},{"$f":"IFERROR(VLOOKUP(L380,'Input Wonen'!$P$13:$T$151,COLUMNS('Input Wonen'!P:R),FALSE),\"\")","v":"Staal; gepoedercoat; spijlen"}]
[null,null,null,"VL09.t",{"$f":"VLOOKUP(D381,'Input Wonen'!$D$13:$H$151,2,FALSE)","v":"Balkon- en galerijvloeren"},{"$f":"VLOOKUP(D381,'Input Wonen'!$D$13:$H$151,3,FALSE)","v":"Prefab beton, 250mm"},null,"VL09.HNN",{"$f":"IFERROR(VLOOKUP(H381,'Input Wonen'!$J$13:$N$151,COLUMNS('Input Wonen'!J:K),FALSE),\"\")","v":"Balkon- en galerijvloeren"},{"$f":"IFERROR(VLOOKUP(H381,'Input Wonen'!$J$13:$N$151,COLUMNS('Input Wonen'!J:L),FALSE),\"\")","v":"Prefab beton, 250mm"},null,"VL09.E",{"$f":"IFERROR(VLOOKUP(L381,'Input Wonen'!$P$13:$T$151,COLUMNS('Input Wonen'!P:Q),FALSE),\"\")","v":"Balkon- en galerijvloeren"},{"$f":"IFERROR(VLOOKUP(L381,'Input Wonen'!$P$13:$T$151,COLUMNS('Input Wonen'!P:R),FALSE),\"\")","v":"HSB element houten vloer + stalen ophanging (56,8 kg/m2 zie detail berekening excel)"}]
[null,null,null,"VL22.t",{"$f":"VLOOKUP(D382,'Input Wonen'!$D$13:$H$151,2,FALSE)","v":"Plafondafwerking, verlaagd plafond"},{"$f":"VLOOKUP(D382,'Input Wonen'!$D$13:$H$151,3,FALSE)","v":"Glaswoltegels"},null,"VL22.HNN",{"$f":"IFERROR(VLOOKUP(H382,'Input Wonen'!$J$13:$N$151,COLUMNS('Input Wonen'!J:K),FALSE),\"\")","v":"Plafondafwerking"},{"$f":"IFERROR(VLOOKUP(H382,'Input Wonen'!$J$13:$N$151,COLUMNS('Input Wonen'!J:L),FALSE),\"\")","v":"Glaswoltegels"},null,"VL22.E",{"$f":"IFERROR(VLOOKUP(L382,'Input Wonen'!$P$13:$T$151,COLUMNS('Input Wonen'!P:Q),FALSE),\"\")","v":"Plafondafwerking"},{"$f":"IFERROR(VLOOKUP(L382,'Input Wonen'!$P$13:$T$151,COLUMNS('Input Wonen'!P:R),FALSE),\"\")","v":"Glaswoltegels"}]
[null,null,null,null,"Draagconstructie",null,null,null,"Draagconstructie",null,null,null,"Draagconstructie"]
[null,null,null,"DR01.t",{"$f":"VLOOKUP(D384,'Input Wonen'!$D$13:$H$151,2,FALSE)","v":"Betonmortel"},{"$f":"VLOOKUP(D384,'Input Wonen'!$D$13:$H$151,3,FALSE)","v":"C20/C25,XC1,S3; 0% betongranulaat"},null,"DR01.HNN",{"$f":"IFERROR(VLOOKUP(H384,'Input Wonen'!$J$13:$N$151,COLUMNS('Input Wonen'!J:K),FALSE),\"\")","v":"Betonmortel"},{"$f":"IFERROR(VLOOKUP(H384,'Input Wonen'!$J$13:$N$151,COLUMNS('Input Wonen'!J:L),FALSE),\"\")","v":"C20/C25,XC1,S3; 20% betongranulaat"},null,"DR01.E",{"$f":"IFERROR(VLOOKUP(L384,'Input Wonen'!$P$13:$T$151,COLUMNS('Input Wonen'!P:Q),FALSE),\"\")","v":"Betonmortel"},{"$f":"IFERROR(VLOOKUP(L384,'Input Wonen'!$P$13:$T$151,COLUMNS('Input Wonen'!P:R),FALSE),\"\")","v":"C20/C25,XC1,S3; 56% betongranulaat"}]
[null,null,null,"DR02.t",{"$f":"VLOOKUP(D385,'Input Wonen'!$D$13:$H$151,2,FALSE)","v":"Wapeningsstaal"},{"$f":"VLOOKUP(D385,'Input Wonen'!$D$13:$H$151,3,FALSE)","v":"Staal"},null,"DR02.HNN",{"$f":"IFERROR(VLOOKUP(H385,'Input Wonen'!$J$13:$N$151,COLUMNS('Input Wonen'!J:K),FALSE),\"\")","v":"Wapeningsstaal"},{"$f":"IFERROR(VLOOKUP(H385,'Input Wonen'!$J$13:$N$151,COLUMNS('Input Wonen'!J:L),FALSE),\"\")","v":"Staal"},null,"DR02.E",{"$f":"IFERROR(VLOOKUP(L385,'Input Wonen'!$P$13:$T$151,COLUMNS('Input Wonen'!P:Q),FALSE),\"\")","v":"Wapeningsstaal"},{"$f":"IFERROR(VLOOKUP(L385,'Input Wonen'!$P$13:$T$151,COLUMNS('Input Wonen'!P:R),FALSE),\"\")","v":"Staal"}]
[null,null,null,"DR03.t",{"$f":"VLOOKUP(D386,'Input Wonen'!$D$13:$H$151,2,FALSE)","v":"Zwaar constructiestaal"},{"$f":"VLOOKUP(D386,'Input Wonen'!$D$13:$H$151,3,FALSE)","v":"7.820 kg/m3, incl. conservering"},null,"DR03.HNN",{"$f":"IFERROR(VLOOKUP(H386,'Input Wonen'!$J$13:$N$151,COLUMNS('Input Wonen'!J:K),FALSE),\"\")","v":"Zwaar constructiestaal"},{"$f":"IFERROR(VLOOKUP(H386,'Input Wonen'!$J$13:$N$151,COLUMNS('Input Wonen'!J:L),FALSE),\"\")","v":"7.820 kg/m3, incl. conservering"},null,"DR03.E",{"$f":"IFERROR(VLOOKUP(L386,'Input Wonen'!$P$13:$T$151,COLUMNS('Input Wonen'!P:Q),FALSE),\"\")","v":"Zwaar constructiestaal"},{"$f":"IFERROR(VLOOKUP(L386,'Input Wonen'!$P$13:$T$151,COLUMNS('Input Wonen'!P:R),FALSE),\"\")","v":"7.820 kg/m3, incl. conservering"}]
[null,null,null,null,"Gevel",null,null,null,"Gevel",null,null,null,"Gevel"]
[null,null,null,"GE29.t",{"$f":"VLOOKUP(D388,'Input Wonen'!$D$13:$H$151,2,FALSE)","v":"Gevelkozijnen; incl. HR++ beglazing"},{"$f":"VLOOKUP(D388,'Input Wonen'!$D$13:$H$151,3,FALSE)","v":"Aluminium"},null,"GE29.HNN",{"$f":"IFERROR(VLOOKUP(H388,'Input Wonen'!$J$13:$N$151,COLUMNS('Input Wonen'!J:K),FALSE),\"\")","v":"Gevelkozijnen; incl. HR++ beglazing"},{"$f":"IFERROR(VLOOKUP(H388,'Input Wonen'!$J$13:$N$151,COLUMNS('Input Wonen'!J:L),FALSE),\"\")","v":"Aluminium; 75% recyclaat (Hydro CIRCAL 75R)"},null,"GE29.E",{"$f":"IFERROR(VLOOKUP(L388,'Input Wonen'!$P$13:$T$151,COLUMNS('Input Wonen'!P:Q),FALSE),\"\")","v":"Gevelkozijnen; incl. Isomax beglazing"},{"$f":"IFERROR(VLOOKUP(L388,'Input Wonen'!$P$13:$T$151,COLUMNS('Input Wonen'!P:R),FALSE),\"\")","v":"Aluminium; 75% recyclaat (Hydro CIRCAL 75R)"}]
[null,null,null,"GE35.t",{"$f":"VLOOKUP(D389,'Input Wonen'!$D$13:$H$151,2,FALSE)","v":"Gevelkozijn; schuifpui "},{"$f":"VLOOKUP(D389,'Input Wonen'!$D$13:$H$151,3,FALSE)","v":"Aluminium, vast en/of draaiend"},null,"GE35.HNN",{"$f":"IFERROR(VLOOKUP(H389,'Input Wonen'!$J$13:$N$151,COLUMNS('Input Wonen'!J:K),FALSE),\"\")","v":"Gevelkozijn, schuifpui "},{"$f":"IFERROR(VLOOKUP(H389,'Input Wonen'!$J$13:$N$151,COLUMNS('Input Wonen'!J:L),FALSE),\"\")","v":"Aluminium, vast en/of draaiend"},null,"GE35.E",{"$f":"IFERROR(VLOOKUP(L389,'Input Wonen'!$P$13:$T$151,COLUMNS('Input Wonen'!P:Q),FALSE),\"\")","v":"Gevelkozijn, schuifpui "},{"$f":"IFERROR(VLOOKUP(L389,'Input Wonen'!$P$13:$T$151,COLUMNS('Input Wonen'!P:R),FALSE),\"\")","v":"Aluminium, vast en/of draaiend"}]
[null,null,null,"GE04.t",{"$f":"VLOOKUP(D390,'Input Wonen'!$D$13:$H$151,2,FALSE)","v":"Vensterbanken"},{"$f":"VLOOKUP(D390,'Input Wonen'!$D$13:$H$151,3,FALSE)","v":"Composietsteen "},null,"GE04.HNN",{"$f":"IFERROR(VLOOKUP(H390,'Input Wonen'!$J$13:$N$151,COLUMNS('Input Wonen'!J:K),FALSE),\"\")","v":"Vensterbanken"},{"$f":"IFERROR(VLOOKUP(H390,'Input Wonen'!$J$13:$N$151,COLUMNS('Input Wonen'!J:L),FALSE),\"\")","v":"Composietsteen"},null,"GE04.E",{"$f":"IFERROR(VLOOKUP(L390,'Input Wonen'!$P$13:$T$151,COLUMNS('Input Wonen'!P:Q),FALSE),\"\")","v":"Vensterbanken"},{"$f":"IFERROR(VLOOKUP(L390,'Input Wonen'!$P$13:$T$151,COLUMNS('Input Wonen'!P:R),FALSE),\"\")","v":"Composietsteen"}]
[null,null,null,"GE22.t",{"$f":"VLOOKUP(D391,'Input Wonen'!$D$13:$H$151,2,FALSE)","v":"Lateien"},{"$f":"VLOOKUP(D391,'Input Wonen'!$D$13:$H$151,3,FALSE)","v":"Prefab beton"},null,"GE22.HNN",{"$f":"IFERROR(VLOOKUP(H391,'Input Wonen'!$J$13:$N$151,COLUMNS('Input Wonen'!J:K),FALSE),\"\")","v":"Lateien"},{"$f":"IFERROR(VLOOKUP(H391,'Input Wonen'!$J$13:$N$151,COLUMNS('Input Wonen'!J:L),FALSE),\"\")","v":"Prefab beton"},null,"GE22.E",{"$f":"IFERROR(VLOOKUP(L391,'Input Wonen'!$P$13:$T$151,COLUMNS('Input Wonen'!P:Q),FALSE),\"\")","v":"Lateien"},{"$f":"IFERROR(VLOOKUP(L391,'Input Wonen'!$P$13:$T$151,COLUMNS('Input Wonen'!P:R),FALSE),\"\")","v":"Prefab beton"}]
[null,null,null,"GE32.t",{"$f":"VLOOKUP(D392,'Input Wonen'!$D$13:$H$151,2,FALSE)","v":"Waterslagen"},{"$f":"VLOOKUP(D392,'Input Wonen'!$D$13:$H$151,3,FALSE)","v":"Aluminium; gemoffeld"},null,"GE32.HNN",{"$f":"IFERROR(VLOOKUP(H392,'Input Wonen'!$J$13:$N$151,COLUMNS('Input Wonen'!J:K),FALSE),\"\")","v":"Waterslagen"},{"$f":"IFERROR(VLOOKUP(H392,'Input Wonen'!$J$13:$N$151,COLUMNS('Input Wonen'!J:L),FALSE),\"\")","v":"Aluminium; gemoffeld"},null,"GE32.E",{"$f":"IFERROR(VLOOKUP(L392,'Input Wonen'!$P$13:$T$151,COLUMNS('Input Wonen'!P:Q),FALSE),\"\")","v":"Waterslagen"},{"$f":"IFERROR(VLOOKUP(L392,'Input Wonen'!$P$13:$T$151,COLUMNS('Input Wonen'!P:R),FALSE),\"\")","v":"Aluminium; gemoffeld"}]
[null,null,null,"GE33.t",{"$f":"VLOOKUP(D393,'Input Wonen'!$D$13:$H$151,2,FALSE)","v":"Waterslagen"},{"$f":"VLOOKUP(D393,'Input Wonen'!$D$13:$H$151,3,FALSE)","v":"Composietsteen; gegoten"},null,"GE33.HNN",{"$f":"IFERROR(VLOOKUP(H393,'Input Wonen'!$J$13:$N$151,COLUMNS('Input Wonen'!J:K),FALSE),\"\")","v":"Waterslagen"},{"$f":"IFERROR(VLOOKUP(H393,'Input Wonen'!$J$13:$N$151,COLUMNS('Input Wonen'!J:L),FALSE),\"\")","v":"Composietsteen; gegoten"},null,"GE33.E",{"$f":"IFERROR(VLOOKUP(L393,'Input Wonen'!$P$13:$T$151,COLUMNS('Input Wonen'!P:Q),FALSE),\"\")","v":"Waterslagen"},{"$f":"IFERROR(VLOOKUP(L393,'Input Wonen'!$P$13:$T$151,COLUMNS('Input Wonen'!P:R),FALSE),\"\")","v":"Composietsteen; gegoten"}]
[null,null,null,"GE34.t",{"$f":"VLOOKUP(D394,'Input Wonen'!$D$13:$H$151,2,FALSE)","v":"Buitendeur; multiplex"},{"$f":"VLOOKUP(D394,'Input Wonen'!$D$13:$H$151,3,FALSE)","v":"Sandwich; 2x multiplex"},null,"GE34.HNN",{"$f":"IFERROR(VLOOKUP(H394,'Input Wonen'!$J$13:$N$151,COLUMNS('Input Wonen'!J:K),FALSE),\"\")","v":"Buitendeur; multiplex"},{"$f":"IFERROR(VLOOKUP(H394,'Input Wonen'!$J$13:$N$151,COLUMNS('Input Wonen'!J:L),FALSE),\"\")","v":"Sandwich; 2x multiplex"},null,"GE34.E",{"$f":"IFERROR(VLOOKUP(L394,'Input Wonen'!$P$13:$T$151,COLUMNS('Input Wonen'!P:Q),FALSE),\"\")","v":"Buitendeur; multiplex"},{"$f":"IFERROR(VLOOKUP(L394,'Input Wonen'!$P$13:$T$151,COLUMNS('Input Wonen'!P:R),FALSE),\"\")","v":"Sandwich; 2x multiplex"}]
[null,null,null,"GE36.t",{"$f":"VLOOKUP(D395,'Input Wonen'!$D$13:$H$151,2,FALSE)","v":"Buitendeur; aluminium"},{"$f":"VLOOKUP(D395,'Input Wonen'!$D$13:$H$151,3,FALSE)","v":"Aluminium, gemoffeld; bekleding volkern"},null,"GE36.HNN",{"$f":"IFERROR(VLOOKUP(H395,'Input Wonen'!$J$13:$N$151,COLUMNS('Input Wonen'!J:K),FALSE),\"\")","v":"Buitendeur; aluminium"},{"$f":"IFERROR(VLOOKUP(H395,'Input Wonen'!$J$13:$N$151,COLUMNS('Input Wonen'!J:L),FALSE),\"\")","v":"Aluminium, gemoffeld; bekleding volkern"},null,"GE36.E",{"$f":"IFERROR(VLOOKUP(L395,'Input Wonen'!$P$13:$T$151,COLUMNS('Input Wonen'!P:Q),FALSE),\"\")","v":"Buitendeur; aluminium"},{"$f":"IFERROR(VLOOKUP(L395,'Input Wonen'!$P$13:$T$151,COLUMNS('Input Wonen'!P:R),FALSE),\"\")","v":"Aluminium, gemoffeld; bekleding volkern"}]
[null,null,null,"GE24.t",{"$f":"VLOOKUP(D396,'Input Wonen'!$D$13:$H$151,2,FALSE)","v":"Binnenspouwblad, 250mm (bruto)"},{"$f":"VLOOKUP(D396,'Input Wonen'!$D$13:$H$151,3,FALSE)","v":"I.h.w.g. beton"},null,"GE24.HNN",{"$f":"IFERROR(VLOOKUP(H396,'Input Wonen'!$J$13:$N$151,COLUMNS('Input Wonen'!J:K),FALSE),\"\")","v":"Binnenspouwblad, 250mm (bruto)"},{"$f":"IFERROR(VLOOKUP(H396,'Input Wonen'!$J$13:$N$151,COLUMNS('Input Wonen'!J:L),FALSE),\"\")","v":"I.h.w.g. beton (UMC)"},null,"GE24.E",{"$f":"IFERROR(VLOOKUP(L396,'Input Wonen'!$P$13:$T$151,COLUMNS('Input Wonen'!P:Q),FALSE),\"\")","v":"Binnenspouwblad, CLT"},{"$f":"IFERROR(VLOOKUP(L396,'Input Wonen'!$P$13:$T$151,COLUMNS('Input Wonen'!P:R),FALSE),\"\")","v":"CLT wanden"}]
[null,null,null,"GE25.t",{"$f":"VLOOKUP(D397,'Input Wonen'!$D$13:$H$151,2,FALSE)","v":"Binnenspouwblad; niet dragend, 250mm (bruto)"},{"$f":"VLOOKUP(D397,'Input Wonen'!$D$13:$H$151,3,FALSE)","v":"HSB element incl. isolatie en beplating"},null,"GE25.HNN",{"$f":"IFERROR(VLOOKUP(H397,'Input Wonen'!$J$13:$N$151,COLUMNS('Input Wonen'!J:K),FALSE),\"\")","v":"Binnenspouwblad; niet dragend, 250mm (bruto)"},{"$f":"IFERROR(VLOOKUP(H397,'Input Wonen'!$J$13:$N$151,COLUMNS('Input Wonen'!J:L),FALSE),\"\")","v":"HSB element incl. isolatie en beplating"},null,"GE25.E",{"$f":"IFERROR(VLOOKUP(L397,'Input Wonen'!$P$13:$T$151,COLUMNS('Input Wonen'!P:Q),FALSE),\"\")","v":"Binnenspouwblad; niet dragend HSB (bruto)"},{"$f":"IFERROR(VLOOKUP(L397,'Input Wonen'!$P$13:$T$151,COLUMNS('Input Wonen'!P:R),FALSE),\"\")","v":"HSB element incl. Isovlas isolatie"}]
[null,null,null,"GE09.t",{"$f":"VLOOKUP(D398,'Input Wonen'!$D$13:$H$151,2,FALSE)","v":"Buitenspouwblad, 100mm"},{"$f":"VLOOKUP(D398,'Input Wonen'!$D$13:$H$151,3,FALSE)","v":"Baksteenmetselwerk"},null,"GE09.HNN",{"$f":"IFERROR(VLOOKUP(H398,'Input Wonen'!$J$13:$N$151,COLUMNS('Input Wonen'!J:K),FALSE),\"\")","v":"Buitenspouwblad"},{"$f":"IFERROR(VLOOKUP(H398,'Input Wonen'!$J$13:$N$151,COLUMNS('Input Wonen'!J:L),FALSE),\"\")","v":"Ecobrick Wienerberger"},null,"GE09.E",{"$f":"IFERROR(VLOOKUP(L398,'Input Wonen'!$P$13:$T$151,COLUMNS('Input Wonen'!P:Q),FALSE),\"\")","v":"Buitenspouwblad"},{"$f":"IFERROR(VLOOKUP(L398,'Input Wonen'!$P$13:$T$151,COLUMNS('Input Wonen'!P:R),FALSE),\"\")","v":"Houten gevelbekleding; Meranti delen"}]
[null,null,null,"GE26.t",{"$f":"VLOOKUP(D399,'Input Wonen'!$D$13:$H$151,2,FALSE)","v":"Isolatielagen, Rc=4,7"},{"$f":"VLOOKUP(D399,'Input Wonen'!$D$13:$H$151,3,FALSE)","v":"Glaswolplaten, MWA 2012"},null,"GE26.HNN",{"$f":"IFERROR(VLOOKUP(H399,'Input Wonen'!$J$13:$N$151,COLUMNS('Input Wonen'!J:K),FALSE),\"\")","v":"Isolatielagen, Rc=4,7"},{"$f":"IFERROR(VLOOKUP(H399,'Input Wonen'!$J$13:$N$151,COLUMNS('Input Wonen'!J:L),FALSE),\"\")","v":"Isovlas plaat, PN160mm"},null,"GE26.E",{"$f":"IFERROR(VLOOKUP(L399,'Input Wonen'!$P$13:$T$151,COLUMNS('Input Wonen'!P:Q),FALSE),\"\")","v":"Isolatielagen, Rc=4,7"},{"$f":"IFERROR(VLOOKUP(L399,'Input Wonen'!$P$13:$T$151,COLUMNS('Input Wonen'!P:R),FALSE),\"\")","v":"Isovlas plaat, PN160mm"}]
[null,null,null,null,"Daken",null,null,null,"Daken",null,null,null,"Daken"]
[null,null,null,"DA02.t",{"$f":"VLOOKUP(D401,'Input Wonen'!$D$13:$H$151,2,FALSE)","v":"Dakvloer: breedplaatvloer, 270mm incl. druklaag"},{"$f":"VLOOKUP(D401,'Input Wonen'!$D$13:$H$151,3,FALSE)","v":"Breedplaatvloer; incl. druklaag "},null,"DA02.HNN",{"$f":"IFERROR(VLOOKUP(H401,'Input Wonen'!$J$13:$N$151,COLUMNS('Input Wonen'!J:K),FALSE),\"\")","v":"Dakvloer: breedplaatvloer, 270mm incl. druklaag"},{"$f":"IFERROR(VLOOKUP(H401,'Input Wonen'!$J$13:$N$151,COLUMNS('Input Wonen'!J:L),FALSE),\"\")","v":"Breedplaatvloer; incl. druklaag (UMC)"},null,"DA18.E",{"$f":"IFERROR(VLOOKUP(L401,'Input Wonen'!$P$13:$T$151,COLUMNS('Input Wonen'!P:Q),FALSE),\"\")","v":"Dakconstructie, plat dak"},{"$f":"IFERROR(VLOOKUP(L401,'Input Wonen'!$P$13:$T$151,COLUMNS('Input Wonen'!P:R),FALSE),\"\")","v":"CLT excl. isolatie"}]
[null,null,null,"DA16.t",{"$f":"VLOOKUP(D402,'Input Wonen'!$D$13:$H$151,2,FALSE)","v":"Isolatielagen; plat dak; Rc=6,3"},{"$f":"VLOOKUP(D402,'Input Wonen'!$D$13:$H$151,3,FALSE)","v":"EPS"},null,"DA16.HNN",{"$f":"IFERROR(VLOOKUP(H402,'Input Wonen'!$J$13:$N$151,COLUMNS('Input Wonen'!J:K),FALSE),\"\")","v":"Isolatielagen; plat dak; Rc=6,3"},{"$f":"IFERROR(VLOOKUP(H402,'Input Wonen'!$J$13:$N$151,COLUMNS('Input Wonen'!J:L),FALSE),\"\")","v":"Houtvezel vlakke isolatieplaten"},null,"DA16.E",{"$f":"IFERROR(VLOOKUP(L402,'Input Wonen'!$P$13:$T$151,COLUMNS('Input Wonen'!P:Q),FALSE),\"\")","v":"Isolatielagen; plat dak; Rc=6,3"},{"$f":"IFERROR(VLOOKUP(L402,'Input Wonen'!$P$13:$T$151,COLUMNS('Input Wonen'!P:R),FALSE),\"\")","v":"Houtvezel vlakke isolatieplaten"}]
[null,null,null,"DA09.t",{"$f":"VLOOKUP(D403,'Input Wonen'!$D$13:$H$151,2,FALSE)","v":"Dakbedekking"},{"$f":"VLOOKUP(D403,'Input Wonen'!$D$13:$H$151,3,FALSE)","v":"Bitumen, gemod. eenlaags 4,3mm"},null,"DA09.HNN",{"$f":"IFERROR(VLOOKUP(H403,'Input Wonen'!$J$13:$N$151,COLUMNS('Input Wonen'!J:K),FALSE),\"\")","v":"Dakbedekking"},{"$f":"IFERROR(VLOOKUP(H403,'Input Wonen'!$J$13:$N$151,COLUMNS('Input Wonen'!J:L),FALSE),\"\")","v":"EPDM losmaakbare dakbedekking"},null,"DA09.E",{"$f":"IFERROR(VLOOKUP(L403,'Input Wonen'!$P$13:$T$151,COLUMNS('Input Wonen'!P:Q),FALSE),\"\")","v":"Dakbedekking"},{"$f":"IFERROR(VLOOKUP(L403,'Input Wonen'!$P$13:$T$151,COLUMNS('Input Wonen'!P:R),FALSE),\"\")","v":"EPDM losmaakbare dakbedekking"}]
[null,null,null,"DA43.t",{"$f":"VLOOKUP(D404,'Input Wonen'!$D$13:$H$151,2,FALSE)","v":"Dakrand binnenblad, 100mm"},{"$f":"VLOOKUP(D404,'Input Wonen'!$D$13:$H$151,3,FALSE)","v":"Cellenbeton blokken, XellaYtong"},null,"DA43.HNN",{"$f":"IFERROR(VLOOKUP(H404,'Input Wonen'!$J$13:$N$151,COLUMNS('Input Wonen'!J:K),FALSE),\"\")","v":"Dakrand binnenblad, 100mm"},{"$f":"IFERROR(VLOOKUP(H404,'Input Wonen'!$J$13:$N$151,COLUMNS('Input Wonen'!J:L),FALSE),\"\")","v":"Cellenbeton blokken, XellaYtong"},null,"DA43.E",{"$f":"IFERROR(VLOOKUP(L404,'Input Wonen'!$P$13:$T$151,COLUMNS('Input Wonen'!P:Q),FALSE),\"\")","v":"Dakrand binnenblad, 100mm"},{"$f":"IFERROR(VLOOKUP(L404,'Input Wonen'!$P$13:$T$151,COLUMNS('Input Wonen'!P:R),FALSE),\"\")","v":"HSB element incl. Isovlas isolatie"}]
[null,null,null,"GE09.t",{"$f":"VLOOKUP(D405,'Input Wonen'!$D$13:$H$151,2,FALSE)","v":"Buitenspouwblad, 100mm"},{"$f":"VLOOKUP(D405,'Input Wonen'!$D$13:$H$151,3,FALSE)","v":"Baksteenmetselwerk"},null,"GE09.HNN",{"$f":"IFERROR(VLOOKUP(H405,'Input Wonen'!$J$13:$N$151,COLUMNS('Input Wonen'!J:K),FALSE),\"\")","v":"Buitenspouwblad"},{"$f":"IFERROR(VLOOKUP(H405,'Input Wonen'!$J$13:$N$151,COLUMNS('Input Wonen'!J:L),FALSE),\"\")","v":"Ecobrick Wienerberger"},null,"GE09.E",{"$f":"IFERROR(VLOOKUP(L405,'Input Wonen'!$P$13:$T$151,COLUMNS('Input Wonen'!P:Q),FALSE),\"\")","v":"Buitenspouwblad"},{"$f":"IFERROR(VLOOKUP(L405,'Input Wonen'!$P$13:$T$151,COLUMNS('Input Wonen'!P:R),FALSE),\"\")","v":"Houten gevelbekleding; Meranti delen"}]
[null,null,null,"DA14.t",{"$f":"VLOOKUP(D406,'Input Wonen'!$D$13:$H$151,2,FALSE)","v":"Waterkeringen"},{"$f":"VLOOKUP(D406,'Input Wonen'!$D$13:$H$151,3,FALSE)","v":"Polyetheen; folie"},null,"DA14.HNN",{"$f":"IFERROR(VLOOKUP(H406,'Input Wonen'!$J$13:$N$151,COLUMNS('Input Wonen'!J:K),FALSE),\"\")","v":"Waterkeringen"},{"$f":"IFERROR(VLOOKUP(H406,'Input Wonen'!$J$13:$N$151,COLUMNS('Input Wonen'!J:L),FALSE),\"\")","v":"Polyetheen; folie"},null,"DA14.E",{"$f":"IFERROR(VLOOKUP(L406,'Input Wonen'!$P$13:$T$151,COLUMNS('Input Wonen'!P:Q),FALSE),\"\")","v":"Waterkeringen"},{"$f":"IFERROR(VLOOKUP(L406,'Input Wonen'!$P$13:$T$151,COLUMNS('Input Wonen'!P:R),FALSE),\"\")","v":"Polyetheen; folie"}]
[null,null,null,"DA04.t",{"$f":"VLOOKUP(D407,'Input Wonen'!$D$13:$H$151,2,FALSE)","v":"Dakafwerking"},{"$f":"VLOOKUP(D407,'Input Wonen'!$D$13:$H$151,3,FALSE)","v":"Daktrim; aluminium gemoffeld"},null,"DA04.HNN",{"$f":"IFERROR(VLOOKUP(H407,'Input Wonen'!$J$13:$N$151,COLUMNS('Input Wonen'!J:K),FALSE),\"\")","v":"Dakafwerking"},{"$f":"IFERROR(VLOOKUP(H407,'Input Wonen'!$J$13:$N$151,COLUMNS('Input Wonen'!J:L),FALSE),\"\")","v":"Daktrim; aluminium gemoffeld"},null,"DA04.E",{"$f":"IFERROR(VLOOKUP(L407,'Input Wonen'!$P$13:$T$151,COLUMNS('Input Wonen'!P:Q),FALSE),\"\")","v":"Dakafwerking"},{"$f":"IFERROR(VLOOKUP(L407,'Input Wonen'!$P$13:$T$151,COLUMNS('Input Wonen'!P:R),FALSE),\"\")","v":"Daktrim; aluminium gemoffeld"}]
[null,null,null,"DA15.t",{"$f":"VLOOKUP(D408,'Input Wonen'!$D$13:$H$151,2,FALSE)","v":"Dakafwerking"},{"$f":"VLOOKUP(D408,'Input Wonen'!$D$13:$H$151,3,FALSE)","v":"Rubbertegel; ballastlaag"},null,"DA15.HNN",{"$f":"IFERROR(VLOOKUP(H408,'Input Wonen'!$J$13:$N$151,COLUMNS('Input Wonen'!J:K),FALSE),\"\")","v":"Dakafwerking"},{"$f":"IFERROR(VLOOKUP(H408,'Input Wonen'!$J$13:$N$151,COLUMNS('Input Wonen'!J:L),FALSE),\"\")","v":"Rubbertegel; ballastlaag"},null,"DA15.E",{"$f":"IFERROR(VLOOKUP(L408,'Input Wonen'!$P$13:$T$151,COLUMNS('Input Wonen'!P:Q),FALSE),\"\")","v":"Dakafwerking"},{"$f":"IFERROR(VLOOKUP(L408,'Input Wonen'!$P$13:$T$151,COLUMNS('Input Wonen'!P:R),FALSE),\"\")","v":"Rubbertegel; ballastlaag"}]
[null,null,null,null,"Binnenwanden",null,null,null,"Binnenwanden",null,null,null,"Binnenwanden"]
[null,null,null,"GE27.t",{"$f":"VLOOKUP(D410,'Input Wonen'!$D$13:$H$151,2,FALSE)","v":"Dragende binnenwanden, 250mm; "},{"$f":"VLOOKUP(D410,'Input Wonen'!$D$13:$H$151,3,FALSE)","v":"I.h.w.g. beton"},null,"GE27.HNN",{"$f":"IFERROR(VLOOKUP(H410,'Input Wonen'!$J$13:$N$151,COLUMNS('Input Wonen'!J:K),FALSE),\"\")","v":"Dragende binnenwanden, 250mm; "},{"$f":"IFERROR(VLOOKUP(H410,'Input Wonen'!$J$13:$N$151,COLUMNS('Input Wonen'!J:L),FALSE),\"\")","v":"I.h.w.g. beton (UMC)"},null,"GE27.E",{"$f":"IFERROR(VLOOKUP(L410,'Input Wonen'!$P$13:$T$151,COLUMNS('Input Wonen'!P:Q),FALSE),\"\")","v":"Dragende binnenwanden"},{"$f":"IFERROR(VLOOKUP(L410,'Input Wonen'!$P$13:$T$151,COLUMNS('Input Wonen'!P:R),FALSE),\"\")","v":"CLT wanden"}]
[null,null,null,"BI01.t",{"$f":"VLOOKUP(D411,'Input Wonen'!$D$13:$H$151,2,FALSE)","v":"Dragende binnenwanden, 250mm; "},{"$f":"VLOOKUP(D411,'Input Wonen'!$D$13:$H$151,3,FALSE)","v":"I.h.w.g. beton"},null,"BI01.HNN",{"$f":"IFERROR(VLOOKUP(H411,'Input Wonen'!$J$13:$N$151,COLUMNS('Input Wonen'!J:K),FALSE),\"\")","v":"Dragende binnenwanden, 250mm; "},{"$f":"IFERROR(VLOOKUP(H411,'Input Wonen'!$J$13:$N$151,COLUMNS('Input Wonen'!J:L),FALSE),\"\")","v":"I.h.w.g. beton (UMC)"},null,"BI01.E",{"$f":"IFERROR(VLOOKUP(L411,'Input Wonen'!$P$13:$T$151,COLUMNS('Input Wonen'!P:Q),FALSE),\"\")","v":"Dragende binnenwanden"},{"$f":"IFERROR(VLOOKUP(L411,'Input Wonen'!$P$13:$T$151,COLUMNS('Input Wonen'!P:R),FALSE),\"\")","v":"I.h.w.g. beton (UMC)"}]
[null,null,null,"BI03.t",{"$f":"VLOOKUP(D412,'Input Wonen'!$D$13:$H$151,2,FALSE)","v":"Binnenwanden, 100mm"},{"$f":"VLOOKUP(D412,'Input Wonen'!$D$13:$H$151,3,FALSE)","v":"Kalkzandsteen lijmblokken, 100mm"},null,"BI03.HNN",{"$f":"IFERROR(VLOOKUP(H412,'Input Wonen'!$J$13:$N$151,COLUMNS('Input Wonen'!J:K),FALSE),\"\")","v":"Binnenwanden, 100mm"},{"$f":"IFERROR(VLOOKUP(H412,'Input Wonen'!$J$13:$N$151,COLUMNS('Input Wonen'!J:L),FALSE),\"\")","v":"Faay volpaneel"},null,"BI03.E",{"$f":"IFERROR(VLOOKUP(L412,'Input Wonen'!$P$13:$T$151,COLUMNS('Input Wonen'!P:Q),FALSE),\"\")","v":"Binnenwanden, 100mm"},{"$f":"IFERROR(VLOOKUP(L412,'Input Wonen'!$P$13:$T$151,COLUMNS('Input Wonen'!P:R),FALSE),\"\")","v":"Faay volpaneel"}]
[null,null,null,"BI05.t",{"$f":"VLOOKUP(D413,'Input Wonen'!$D$13:$H$151,2,FALSE)","v":"Binnenwanden, 70mm"},{"$f":"VLOOKUP(D413,'Input Wonen'!$D$13:$H$151,3,FALSE)","v":"Gipsblokken, normale dichtheid"},null,"BI05.HNN",{"$f":"IFERROR(VLOOKUP(H413,'Input Wonen'!$J$13:$N$151,COLUMNS('Input Wonen'!J:K),FALSE),\"\")","v":"Binnenwanden, 70mm"},{"$f":"IFERROR(VLOOKUP(H413,'Input Wonen'!$J$13:$N$151,COLUMNS('Input Wonen'!J:L),FALSE),\"\")","v":"Faay volpaneel"},null,"BI05.E",{"$f":"IFERROR(VLOOKUP(L413,'Input Wonen'!$P$13:$T$151,COLUMNS('Input Wonen'!P:Q),FALSE),\"\")","v":"Binnenwanden, 70mm"},{"$f":"IFERROR(VLOOKUP(L413,'Input Wonen'!$P$13:$T$151,COLUMNS('Input Wonen'!P:R),FALSE),\"\")","v":"Faay volpaneel"}]
[null,null,null,"BI14.t",{"$f":"VLOOKUP(D414,'Input Wonen'!$D$13:$H$151,2,FALSE)","v":"Systeemwanden; gipskartonplaat, 100mm"},{"$f":"VLOOKUP(D414,'Input Wonen'!$D$13:$H$151,3,FALSE)","v":"Enkel beplaat, 60 mm glaswol"},null,"BI14.HNN",{"$f":"IFERROR(VLOOKUP(H414,'Input Wonen'!$J$13:$N$151,COLUMNS('Input Wonen'!J:K),FALSE),\"\")","v":"Binnenwanden, 35mm"},{"$f":"IFERROR(VLOOKUP(H414,'Input Wonen'!$J$13:$N$151,COLUMNS('Input Wonen'!J:L),FALSE),\"\")","v":"Faay volpaneel"},null,"BI14.E",{"$f":"IFERROR(VLOOKUP(L414,'Input Wonen'!$P$13:$T$151,COLUMNS('Input Wonen'!P:Q),FALSE),\"\")","v":"Binnenwanden, 54mm"},{"$f":"IFERROR(VLOOKUP(L414,'Input Wonen'!$P$13:$T$151,COLUMNS('Input Wonen'!P:R),FALSE),\"\")","v":"Faay volpaneel; enkel beplaat"}]
[null,null,null,"BI04.t",{"$f":"VLOOKUP(D415,'Input Wonen'!$D$13:$H$151,2,FALSE)","v":"Wandtegelwerk badkamer, toilet en keuken"},{"$f":"VLOOKUP(D415,'Input Wonen'!$D$13:$H$151,3,FALSE)","v":"Keramische tegels; geglazuurd/gelijmd"},null,"BI04.HNN",{"$f":"IFERROR(VLOOKUP(H415,'Input Wonen'!$J$13:$N$151,COLUMNS('Input Wonen'!J:K),FALSE),\"\")","v":"Wandtegelwerk badkamer, toilet en keuken"},{"$f":"IFERROR(VLOOKUP(H415,'Input Wonen'!$J$13:$N$151,COLUMNS('Input Wonen'!J:L),FALSE),\"\")","v":"Mosa C2C wandtegels"},null,"BI04.E",{"$f":"IFERROR(VLOOKUP(L415,'Input Wonen'!$P$13:$T$151,COLUMNS('Input Wonen'!P:Q),FALSE),\"\")","v":"Wandtegelwerk badkamer, toilet en keuken"},{"$f":"IFERROR(VLOOKUP(L415,'Input Wonen'!$P$13:$T$151,COLUMNS('Input Wonen'!P:R),FALSE),\"\")","v":"Gerecycled PET i.c.m. Quartz"}]
[null,null,null,"GE37.t",{"$f":"VLOOKUP(D416,'Input Wonen'!$D$13:$H$151,2,FALSE)","v":"Isolatielagen, Rc=0,55"},{"$f":"VLOOKUP(D416,'Input Wonen'!$D$13:$H$151,3,FALSE)","v":"XPS"},null,"GE37.HNN",{"$f":"IFERROR(VLOOKUP(H416,'Input Wonen'!$J$13:$N$151,COLUMNS('Input Wonen'!J:K),FALSE),\"\")","v":"Binnenwanden, 35mm"},{"$f":"IFERROR(VLOOKUP(H416,'Input Wonen'!$J$13:$N$151,COLUMNS('Input Wonen'!J:L),FALSE),\"\")","v":"Faay volpaneel"},null,"GE37.E",{"$f":"IFERROR(VLOOKUP(L416,'Input Wonen'!$P$13:$T$151,COLUMNS('Input Wonen'!P:Q),FALSE),\"\")","v":"Binnenwanden, 35mm"},{"$f":"IFERROR(VLOOKUP(L416,'Input Wonen'!$P$13:$T$151,COLUMNS('Input Wonen'!P:R),FALSE),\"\")","v":"Faay volpaneel"}]
[null,null,null,"BI12.t",{"$f":"VLOOKUP(D417,'Input Wonen'!$D$13:$H$151,2,FALSE)","v":"Binnenkozijnen, incl. deuren"},{"$f":"VLOOKUP(D417,'Input Wonen'!$D$13:$H$151,3,FALSE)","v":"Europees naaldhout, geschilderd"},null,"BI12.HNN",{"$f":"IFERROR(VLOOKUP(H417,'Input Wonen'!$J$13:$N$151,COLUMNS('Input Wonen'!J:K),FALSE),\"\")","v":"Binnenkozijnen, incl. deuren"},{"$f":"IFERROR(VLOOKUP(H417,'Input Wonen'!$J$13:$N$151,COLUMNS('Input Wonen'!J:L),FALSE),\"\")","v":"Europees naaldhout, geschilderd"},null,"BI12.E",{"$f":"IFERROR(VLOOKUP(L417,'Input Wonen'!$P$13:$T$151,COLUMNS('Input Wonen'!P:Q),FALSE),\"\")","v":"Binnenkozijnen, incl. deuren"},{"$f":"IFERROR(VLOOKUP(L417,'Input Wonen'!$P$13:$T$151,COLUMNS('Input Wonen'!P:R),FALSE),\"\")","v":"Europees naaldhout, geschilderd"}]
[null,null,null,"BI15.t",{"$f":"VLOOKUP(D418,'Input Wonen'!$D$13:$H$151,2,FALSE)","v":"Binnenkozijnen"},{"$f":"VLOOKUP(D418,'Input Wonen'!$D$13:$H$151,3,FALSE)","v":"Staal; verzinkt+gemoffeld"},null,"BI15.HNN",{"$f":"IFERROR(VLOOKUP(H418,'Input Wonen'!$J$13:$N$151,COLUMNS('Input Wonen'!J:K),FALSE),\"\")","v":"Binnenkozijnen"},{"$f":"IFERROR(VLOOKUP(H418,'Input Wonen'!$J$13:$N$151,COLUMNS('Input Wonen'!J:L),FALSE),\"\")","v":"Staal; verzinkt+gemoffeld"},null,"BI15.E",{"$f":"IFERROR(VLOOKUP(L418,'Input Wonen'!$P$13:$T$151,COLUMNS('Input Wonen'!P:Q),FALSE),\"\")","v":"Binnenkozijnen"},{"$f":"IFERROR(VLOOKUP(L418,'Input Wonen'!$P$13:$T$151,COLUMNS('Input Wonen'!P:R),FALSE),\"\")","v":"Staal; verzinkt+gemoffeld"}]
[null,null,null,"BI17.t",{"$f":"VLOOKUP(D419,'Input Wonen'!$D$13:$H$151,2,FALSE)","v":"Binnenbeglazing"},{"$f":"VLOOKUP(D419,'Input Wonen'!$D$13:$H$151,3,FALSE)","v":"Enkel glas"},null,"BI17.HNN",{"$f":"IFERROR(VLOOKUP(H419,'Input Wonen'!$J$13:$N$151,COLUMNS('Input Wonen'!J:K),FALSE),\"\")","v":"Binnenbeglazing"},{"$f":"IFERROR(VLOOKUP(H419,'Input Wonen'!$J$13:$N$151,COLUMNS('Input Wonen'!J:L),FALSE),\"\")","v":"Enkel glas"},null,"BI17.E",{"$f":"IFERROR(VLOOKUP(L419,'Input Wonen'!$P$13:$T$151,COLUMNS('Input Wonen'!P:Q),FALSE),\"\")","v":"Binnenbeglazing"},{"$f":"IFERROR(VLOOKUP(L419,'Input Wonen'!$P$13:$T$151,COLUMNS('Input Wonen'!P:R),FALSE),\"\")","v":"Enkel glas"}]
[null,null,null,"BI08.t",{"$f":"VLOOKUP(D420,'Input Wonen'!$D$13:$H$151,2,FALSE)","v":"Binnendeuren"},{"$f":"VLOOKUP(D420,'Input Wonen'!$D$13:$H$151,3,FALSE)","v":"Honingraat; vlakke binnendeur"},null,"BI08.HNN",{"$f":"IFERROR(VLOOKUP(H420,'Input Wonen'!$J$13:$N$151,COLUMNS('Input Wonen'!J:K),FALSE),\"\")","v":"Binnendeuren"},{"$f":"IFERROR(VLOOKUP(H420,'Input Wonen'!$J$13:$N$151,COLUMNS('Input Wonen'!J:L),FALSE),\"\")","v":"Honingraat; vlakke binnendeur"},null,"BI08.E",{"$f":"IFERROR(VLOOKUP(L420,'Input Wonen'!$P$13:$T$151,COLUMNS('Input Wonen'!P:Q),FALSE),\"\")","v":"Binnendeuren"},{"$f":"IFERROR(VLOOKUP(L420,'Input Wonen'!$P$13:$T$151,COLUMNS('Input Wonen'!P:R),FALSE),\"\")","v":"Honingraat; vlakke binnendeur"}]
[null,null,null,null,"Klimaatinstallaties",null,null,null,"Klimaatinstallaties",null,null,null,"Klimaatinstallaties"]
[null,null,null,"KL06.t",{"$f":"VLOOKUP(D422,'Input Wonen'!$D$13:$H$151,2,FALSE)","v":"Waterleidingen, verwarmd tapwater"},{"$f":"VLOOKUP(D422,'Input Wonen'!$D$13:$H$151,3,FALSE)","v":"PVC, incl. mantelbuis 15mm; W-bouw"},null,"KL06.HNN",{"$f":"IFERROR(VLOOKUP(H422,'Input Wonen'!$J$13:$N$151,COLUMNS('Input Wonen'!J:K),FALSE),\"\")","v":"Waterleidingen, verwarmd tapwater"},{"$f":"IFERROR(VLOOKUP(H422,'Input Wonen'!$J$13:$N$151,COLUMNS('Input Wonen'!J:L),FALSE),\"\")","v":"PVC, incl. mantelbuis 15mm; W-bouw"},null,"KL06.E",{"$f":"IFERROR(VLOOKUP(L422,'Input Wonen'!$P$13:$T$151,COLUMNS('Input Wonen'!P:Q),FALSE),\"\")","v":"Waterleidingen, verwarmd tapwater"},{"$f":"IFERROR(VLOOKUP(L422,'Input Wonen'!$P$13:$T$151,COLUMNS('Input Wonen'!P:R),FALSE),\"\")","v":"PVC, incl. mantelbuis 15mm; W-bouw"}]
[null,null,null,"KL07.t",{"$f":"VLOOKUP(D423,'Input Wonen'!$D$13:$H$151,2,FALSE)","v":"Warmtapwaterinstallatie"},{"$f":"VLOOKUP(D423,'Input Wonen'!$D$13:$H$151,3,FALSE)","v":"Elektrische boiler; CW:4-6 120 liter"},null,"KL07.HNN",{"$f":"IFERROR(VLOOKUP(H423,'Input Wonen'!$J$13:$N$151,COLUMNS('Input Wonen'!J:K),FALSE),\"\")","v":"Warmtapwaterinstallatie"},{"$f":"IFERROR(VLOOKUP(H423,'Input Wonen'!$J$13:$N$151,COLUMNS('Input Wonen'!J:L),FALSE),\"\")","v":"Elektrische boiler; CW:4-6 120 liter"},null,"KL07.E",{"$f":"IFERROR(VLOOKUP(L423,'Input Wonen'!$P$13:$T$151,COLUMNS('Input Wonen'!P:Q),FALSE),\"\")","v":"Warmtapwaterinstallatie"},{"$f":"IFERROR(VLOOKUP(L423,'Input Wonen'!$P$13:$T$151,COLUMNS('Input Wonen'!P:R),FALSE),\"\")","v":"Elektrische boiler; CW:4-6 120 liter"}]
[null,null,null,"KL03.t",{"$f":"VLOOKUP(D424,'Input Wonen'!$D$13:$H$151,2,FALSE)","v":"Warmteafgiftesysteem"},{"$f":"VLOOKUP(D424,'Input Wonen'!$D$13:$H$151,3,FALSE)","v":"Vloerverwarming 95 W/m2"},null,"KL03.HNN",{"$f":"IFERROR(VLOOKUP(H424,'Input Wonen'!$J$13:$N$151,COLUMNS('Input Wonen'!J:K),FALSE),\"\")","v":"Warmteafgiftesysteem"},{"$f":"IFERROR(VLOOKUP(H424,'Input Wonen'!$J$13:$N$151,COLUMNS('Input Wonen'!J:L),FALSE),\"\")","v":"Vloerverwarming 95 W/m2"},null,"KL03.E",{"$f":"IFERROR(VLOOKUP(L424,'Input Wonen'!$P$13:$T$151,COLUMNS('Input Wonen'!P:Q),FALSE),\"\")","v":"Warmteafgiftesysteem"},{"$f":"IFERROR(VLOOKUP(L424,'Input Wonen'!$P$13:$T$151,COLUMNS('Input Wonen'!P:R),FALSE),\"\")","v":"Vloerverwarming 95 W/m2 "}]
[null,null,null,"KL08.t",{"$f":"VLOOKUP(D425,'Input Wonen'!$D$13:$H$151,2,FALSE)","v":"Warmteopwekkinginstallatie"},{"$f":"VLOOKUP(D425,'Input Wonen'!$D$13:$H$151,3,FALSE)","v":"Warmtepomp luchtwater 10kW"},null,"KL08.HNN",{"$f":"IFERROR(VLOOKUP(H425,'Input Wonen'!$J$13:$N$151,COLUMNS('Input Wonen'!J:K),FALSE),\"\")","v":"Warmteopwekkinginstallatie"},{"$f":"IFERROR(VLOOKUP(H425,'Input Wonen'!$J$13:$N$151,COLUMNS('Input Wonen'!J:L),FALSE),\"\")","v":"Warmtepomp luchtwater 10kW"},null,"KL08.E",{"$f":"IFERROR(VLOOKUP(L425,'Input Wonen'!$P$13:$T$151,COLUMNS('Input Wonen'!P:Q),FALSE),\"\")","v":"Warmteopwekkinginstallatie"},{"$f":"IFERROR(VLOOKUP(L425,'Input Wonen'!$P$13:$T$151,COLUMNS('Input Wonen'!P:R),FALSE),\"\")","v":"Warmtepomp luchtwater 10kW"}]
[null,null,null,"KL02.t",{"$f":"VLOOKUP(D426,'Input Wonen'!$D$13:$H$151,2,FALSE)","v":"Warmtedistributiesysteem"},{"$f":"VLOOKUP(D426,'Input Wonen'!$D$13:$H$151,3,FALSE)","v":"CV-leidingen incl. koppelingen + verdeling"},null,"KL02.HNN",{"$f":"IFERROR(VLOOKUP(H426,'Input Wonen'!$J$13:$N$151,COLUMNS('Input Wonen'!J:K),FALSE),\"\")","v":"Warmtedistributiesysteem"},{"$f":"IFERROR(VLOOKUP(H426,'Input Wonen'!$J$13:$N$151,COLUMNS('Input Wonen'!J:L),FALSE),\"\")","v":"CV-leidingen incl. koppelingen + verdeling"},null,"KL02.E",{"$f":"IFERROR(VLOOKUP(L426,'Input Wonen'!$P$13:$T$151,COLUMNS('Input Wonen'!P:Q),FALSE),\"\")","v":"Warmtedistributiesysteem"},{"$f":"IFERROR(VLOOKUP(L426,'Input Wonen'!$P$13:$T$151,COLUMNS('Input Wonen'!P:R),FALSE),\"\")","v":"CV-leidingen incl. koppelingen + verdeling"}]
[null,null,null,"KL05.t",{"$f":"VLOOKUP(D427,'Input Wonen'!$D$13:$H$151,2,FALSE)","v":"Luchtdistributiesysteem"},{"$f":"VLOOKUP(D427,'Input Wonen'!$D$13:$H$151,3,FALSE)","v":"VLA ventilatiesysteem, type D met centrale wtw; W-bouw, individueel"},null,"KL05.HNN",{"$f":"IFERROR(VLOOKUP(H427,'Input Wonen'!$J$13:$N$151,COLUMNS('Input Wonen'!J:K),FALSE),\"\")","v":"Luchtdistributiesysteem"},{"$f":"IFERROR(VLOOKUP(H427,'Input Wonen'!$J$13:$N$151,COLUMNS('Input Wonen'!J:L),FALSE),\"\")","v":"VLA ventilatiesysteem, type D met centrale wtw; W-bouw, individueel"},null,"KL05.E",{"$f":"IFERROR(VLOOKUP(L427,'Input Wonen'!$P$13:$T$151,COLUMNS('Input Wonen'!P:Q),FALSE),\"\")","v":"Luchtdistributiesysteem"},{"$f":"IFERROR(VLOOKUP(L427,'Input Wonen'!$P$13:$T$151,COLUMNS('Input Wonen'!P:R),FALSE),\"\")","v":"VLA ventilatiesysteem, type D met centrale wtw; W-bouw, individueel"}]
[null,null,null,null,"Elektrische installaties",null,null,null,"Elektrische installaties",null,null,null,"Elektrische installaties"]
[null,null,null,"EL05.t",{"$f":"VLOOKUP(D429,'Input Wonen'!$D$13:$H$151,2,FALSE)","v":"Elektriciteitsleidingen"},{"$f":"VLOOKUP(D429,'Input Wonen'!$D$13:$H$151,3,FALSE)","v":"Koper met PP-isolatie"},null,"EL05.HNN",{"$f":"IFERROR(VLOOKUP(H429,'Input Wonen'!$J$13:$N$151,COLUMNS('Input Wonen'!J:K),FALSE),\"\")","v":"Elektriciteitsleidingen"},{"$f":"IFERROR(VLOOKUP(H429,'Input Wonen'!$J$13:$N$151,COLUMNS('Input Wonen'!J:L),FALSE),\"\")","v":"Koper met PP-isolatie"},null,"EL05.E",{"$f":"IFERROR(VLOOKUP(L429,'Input Wonen'!$P$13:$T$151,COLUMNS('Input Wonen'!P:Q),FALSE),\"\")","v":"Elektriciteitsleidingen"},{"$f":"IFERROR(VLOOKUP(L429,'Input Wonen'!$P$13:$T$151,COLUMNS('Input Wonen'!P:R),FALSE),\"\")","v":"Koper met PP-isolatie"}]
[null,null,null,"EL03.t",{"$f":"VLOOKUP(D430,'Input Wonen'!$D$13:$H$151,2,FALSE)","v":"Pv-panelen, plat dak"},{"$f":"VLOOKUP(D430,'Input Wonen'!$D$13:$H$151,3,FALSE)","v":"Mono-Si; incl. inverter+kabels"},null,"EL03.HNN",{"$f":"IFERROR(VLOOKUP(H430,'Input Wonen'!$J$13:$N$151,COLUMNS('Input Wonen'!J:K),FALSE),\"\")","v":"Pv-panelen, plat dak"},{"$f":"IFERROR(VLOOKUP(H430,'Input Wonen'!$J$13:$N$151,COLUMNS('Input Wonen'!J:L),FALSE),\"\")","v":"Exasun Xglass"},null,"EL03.E",{"$f":"IFERROR(VLOOKUP(L430,'Input Wonen'!$P$13:$T$151,COLUMNS('Input Wonen'!P:Q),FALSE),\"\")","v":"Pv-panelen, plat dak"},{"$f":"IFERROR(VLOOKUP(L430,'Input Wonen'!$P$13:$T$151,COLUMNS('Input Wonen'!P:R),FALSE),\"\")","v":"Exasun Xglass"}]
[null,null,null,"EL04.t",{"$f":"VLOOKUP(D431,'Input Wonen'!$D$13:$H$151,2,FALSE)","v":"Verlichting"},{"$f":"VLOOKUP(D431,'Input Wonen'!$D$13:$H$151,3,FALSE)","v":"LED-120cm"},null,"EL04.HNN",{"$f":"IFERROR(VLOOKUP(H431,'Input Wonen'!$J$13:$N$151,COLUMNS('Input Wonen'!J:K),FALSE),\"\")","v":"Verlichting"},{"$f":"IFERROR(VLOOKUP(H431,'Input Wonen'!$J$13:$N$151,COLUMNS('Input Wonen'!J:L),FALSE),\"\")","v":"LED-120cm"},null,"EL04.E",{"$f":"IFERROR(VLOOKUP(L431,'Input Wonen'!$P$13:$T$151,COLUMNS('Input Wonen'!P:Q),FALSE),\"\")","v":"Verlichting"},{"$f":"IFERROR(VLOOKUP(L431,'Input Wonen'!$P$13:$T$151,COLUMNS('Input Wonen'!P:R),FALSE),\"\")","v":"LED-120cm"}]
[null,null,null,null,"Toe- en afvoeren",null,null,null,"Toe- en afvoeren",null,null,null,"Toe- en afvoeren"]
[null,null,null,"TO01.t",{"$f":"VLOOKUP(D433,'Input Wonen'!$D$13:$H$151,2,FALSE)","v":"Waterleidingen"},{"$f":"VLOOKUP(D433,'Input Wonen'!$D$13:$H$151,3,FALSE)","v":"Polyetheen; leiding+mantelbuis"},null,"TO01.HNN",{"$f":"IFERROR(VLOOKUP(H433,'Input Wonen'!$J$13:$N$151,COLUMNS('Input Wonen'!J:K),FALSE),\"\")","v":"Waterleidingen"},{"$f":"IFERROR(VLOOKUP(H433,'Input Wonen'!$J$13:$N$151,COLUMNS('Input Wonen'!J:L),FALSE),\"\")","v":"Polyetheen"},null,"TO01.E",{"$f":"IFERROR(VLOOKUP(L433,'Input Wonen'!$P$13:$T$151,COLUMNS('Input Wonen'!P:Q),FALSE),\"\")","v":"Waterleidingen"},{"$f":"IFERROR(VLOOKUP(L433,'Input Wonen'!$P$13:$T$151,COLUMNS('Input Wonen'!P:R),FALSE),\"\")","v":"Polyetheen"}]
[null,null,null,"TO02.t",{"$f":"VLOOKUP(D434,'Input Wonen'!$D$13:$H$151,2,FALSE)","v":"Buitenriolering kavel"},{"$f":"VLOOKUP(D434,'Input Wonen'!$D$13:$H$151,3,FALSE)","v":"PVC"},null,"TO02.HNN",{"$f":"IFERROR(VLOOKUP(H434,'Input Wonen'!$J$13:$N$151,COLUMNS('Input Wonen'!J:K),FALSE),\"\")","v":"Buitenriolering"},{"$f":"IFERROR(VLOOKUP(H434,'Input Wonen'!$J$13:$N$151,COLUMNS('Input Wonen'!J:L),FALSE),\"\")","v":"Gerecycled PVC (Pipelife)"},null,"TO02.E",{"$f":"IFERROR(VLOOKUP(L434,'Input Wonen'!$P$13:$T$151,COLUMNS('Input Wonen'!P:Q),FALSE),\"\")","v":"Buitenriolering"},{"$f":"IFERROR(VLOOKUP(L434,'Input Wonen'!$P$13:$T$151,COLUMNS('Input Wonen'!P:R),FALSE),\"\")","v":"Gerecycled PVC (Pipelife)"}]
[null,null,null,"TO03.t",{"$f":"VLOOKUP(D435,'Input Wonen'!$D$13:$H$151,2,FALSE)","v":"Binnenriolering"},{"$f":"VLOOKUP(D435,'Input Wonen'!$D$13:$H$151,3,FALSE)","v":"PVC"},null,"TO03.HNN",{"$f":"IFERROR(VLOOKUP(H435,'Input Wonen'!$J$13:$N$151,COLUMNS('Input Wonen'!J:K),FALSE),\"\")","v":"Binnenriolering"},{"$f":"IFERROR(VLOOKUP(H435,'Input Wonen'!$J$13:$N$151,COLUMNS('Input Wonen'!J:L),FALSE),\"\")","v":"Gerecycled PVC (Pipelife)"},null,"TO03.E",{"$f":"IFERROR(VLOOKUP(L435,'Input Wonen'!$P$13:$T$151,COLUMNS('Input Wonen'!P:Q),FALSE),\"\")","v":"Binnenriolering"},{"$f":"IFERROR(VLOOKUP(L435,'Input Wonen'!$P$13:$T$151,COLUMNS('Input Wonen'!P:R),FALSE),\"\")","v":"Gerecycled PVC (Pipelife)"}]
[null,null,null,"TO04.t",{"$f":"VLOOKUP(D436,'Input Wonen'!$D$13:$H$151,2,FALSE)","v":"Hemelwaterafvoer"},{"$f":"VLOOKUP(D436,'Input Wonen'!$D$13:$H$151,3,FALSE)","v":"PVC"},null,"TO04.HNN",{"$f":"IFERROR(VLOOKUP(H436,'Input Wonen'!$J$13:$N$151,COLUMNS('Input Wonen'!J:K),FALSE),\"\")","v":"Hemelwaterafvoer"},{"$f":"IFERROR(VLOOKUP(H436,'Input Wonen'!$J$13:$N$151,COLUMNS('Input Wonen'!J:L),FALSE),\"\")","v":"Gerecycled PVC (Pipelife)"},null,"TO04.E",{"$f":"IFERROR(VLOOKUP(L436,'Input Wonen'!$P$13:$T$151,COLUMNS('Input Wonen'!P:Q),FALSE),\"\")","v":"Hemelwaterafvoer"},{"$f":"IFERROR(VLOOKUP(L436,'Input Wonen'!$P$13:$T$151,COLUMNS('Input Wonen'!P:R),FALSE),\"\")","v":"Gerecycled PVC (Pipelife)"}]
[null,null,null,null,"Verkeersruimte",null,null,null,"Verkeersruimte",null,null,null,"Verkeersruimte"]
[null,null,null,"VE02.t",{"$f":"VLOOKUP(D438,'Input Wonen'!$D$13:$H$151,2,FALSE)","v":"Centrale trap"},{"$f":"VLOOKUP(D438,'Input Wonen'!$D$13:$H$151,3,FALSE)","v":"Prefab beton"},null,"VE02.HNN",{"$f":"IFERROR(VLOOKUP(H438,'Input Wonen'!$J$13:$N$151,COLUMNS('Input Wonen'!J:K),FALSE),\"\")","v":"Centrale trap"},{"$f":"IFERROR(VLOOKUP(H438,'Input Wonen'!$J$13:$N$151,COLUMNS('Input Wonen'!J:L),FALSE),\"\")","v":"Prefab beton"},null,"VE02.E",{"$f":"IFERROR(VLOOKUP(L438,'Input Wonen'!$P$13:$T$151,COLUMNS('Input Wonen'!P:Q),FALSE),\"\")","v":"Centrale trap"},{"$f":"IFERROR(VLOOKUP(L438,'Input Wonen'!$P$13:$T$151,COLUMNS('Input Wonen'!P:R),FALSE),\"\")","v":"Prefab beton"}]
[null,null,null,"VE06.t",{"$f":"VLOOKUP(D439,'Input Wonen'!$D$13:$H$151,2,FALSE)","v":"Leuningen"},{"$f":"VLOOKUP(D439,'Input Wonen'!$D$13:$H$151,3,FALSE)","v":"Aluminium"},null,"VE06.HNN",{"$f":"IFERROR(VLOOKUP(H439,'Input Wonen'!$J$13:$N$151,COLUMNS('Input Wonen'!J:K),FALSE),\"\")","v":"Leuningen"},{"$f":"IFERROR(VLOOKUP(H439,'Input Wonen'!$J$13:$N$151,COLUMNS('Input Wonen'!J:L),FALSE),\"\")","v":"Aluminium"},null,"VE06.E",{"$f":"IFERROR(VLOOKUP(L439,'Input Wonen'!$P$13:$T$151,COLUMNS('Input Wonen'!P:Q),FALSE),\"\")","v":"Leuningen"},{"$f":"IFERROR(VLOOKUP(L439,'Input Wonen'!$P$13:$T$151,COLUMNS('Input Wonen'!P:R),FALSE),\"\")","v":"Aluminium"}]
[null,null,null,"VE09.t",{"$f":"VLOOKUP(D440,'Input Wonen'!$D$13:$H$151,2,FALSE)","v":"Balustrades"},{"$f":"VLOOKUP(D440,'Input Wonen'!$D$13:$H$151,3,FALSE)","v":"Staal; gepoedercoat; spijlen"},null,"VE09.HNN",{"$f":"IFERROR(VLOOKUP(H440,'Input Wonen'!$J$13:$N$151,COLUMNS('Input Wonen'!J:K),FALSE),\"\")","v":"Balustrades"},{"$f":"IFERROR(VLOOKUP(H440,'Input Wonen'!$J$13:$N$151,COLUMNS('Input Wonen'!J:L),FALSE),\"\")","v":"Staal; gepoedercoat; spijlen"},null,"VE09.E",{"$f":"IFERROR(VLOOKUP(L440,'Input Wonen'!$P$13:$T$151,COLUMNS('Input Wonen'!P:Q),FALSE),\"\")","v":"Balustrades"},{"$f":"IFERROR(VLOOKUP(L440,'Input Wonen'!$P$13:$T$151,COLUMNS('Input Wonen'!P:R),FALSE),\"\")","v":"Staal; gepoedercoat; spijlen"}]
[null,null,null,"VE08.t",{"$f":"VLOOKUP(D441,'Input Wonen'!$D$13:$H$151,2,FALSE)","v":"Liftinstallatie"},{"$f":"VLOOKUP(D441,'Input Wonen'!$D$13:$H$151,3,FALSE)","v":"Staal"},null,"VE08.HNN",{"$f":"IFERROR(VLOOKUP(H441,'Input Wonen'!$J$13:$N$151,COLUMNS('Input Wonen'!J:K),FALSE),\"\")","v":"Liftinstallatie"},{"$f":"IFERROR(VLOOKUP(H441,'Input Wonen'!$J$13:$N$151,COLUMNS('Input Wonen'!J:L),FALSE),\"\")","v":"Staal"},null,"VE08.E",{"$f":"IFERROR(VLOOKUP(L441,'Input Wonen'!$P$13:$T$151,COLUMNS('Input Wonen'!P:Q),FALSE),\"\")","v":"Liftinstallatie"},{"$f":"IFERROR(VLOOKUP(L441,'Input Wonen'!$P$13:$T$151,COLUMNS('Input Wonen'!P:R),FALSE),\"\")","v":"Staal"}]
[null,null,null,null,"Vaste voorzieningen",null,null,null,"Vaste voorzieningen",null,null,null,"Vaste voorzieningen"]
[null,null,null,"VA01.t",{"$f":"VLOOKUP(D443,'Input Wonen'!$D$13:$H$151,2,FALSE)","v":"Toiletten; wandcloset + fontein"},{"$f":"VLOOKUP(D443,'Input Wonen'!$D$13:$H$151,3,FALSE)","v":"Porselein"},null,"VA01.HNN",{"$f":"IFERROR(VLOOKUP(H443,'Input Wonen'!$J$13:$N$151,COLUMNS('Input Wonen'!J:K),FALSE),\"\")","v":"Toiletten; wandcloset + fontein"},{"$f":"IFERROR(VLOOKUP(H443,'Input Wonen'!$J$13:$N$151,COLUMNS('Input Wonen'!J:L),FALSE),\"\")","v":"Porselein"},null,"VA01.E",{"$f":"IFERROR(VLOOKUP(L443,'Input Wonen'!$P$13:$T$151,COLUMNS('Input Wonen'!P:Q),FALSE),\"\")","v":"Toiletten; wandcloset + fontein"},{"$f":"IFERROR(VLOOKUP(L443,'Input Wonen'!$P$13:$T$151,COLUMNS('Input Wonen'!P:R),FALSE),\"\")","v":"Porselein"}]
[null,null,null,"VA02.t",{"$f":"VLOOKUP(D444,'Input Wonen'!$D$13:$H$151,2,FALSE)","v":"Wastafel"},{"$f":"VLOOKUP(D444,'Input Wonen'!$D$13:$H$151,3,FALSE)","v":"Keramisch"},null,"VA02.HNN",{"$f":"IFERROR(VLOOKUP(H444,'Input Wonen'!$J$13:$N$151,COLUMNS('Input Wonen'!J:K),FALSE),\"\")","v":"Wastafel"},{"$f":"IFERROR(VLOOKUP(H444,'Input Wonen'!$J$13:$N$151,COLUMNS('Input Wonen'!J:L),FALSE),\"\")","v":"Keramisch"},null,"VA02.E",{"$f":"IFERROR(VLOOKUP(L444,'Input Wonen'!$P$13:$T$151,COLUMNS('Input Wonen'!P:Q),FALSE),\"\")","v":"Wastafel"},{"$f":"IFERROR(VLOOKUP(L444,'Input Wonen'!$P$13:$T$151,COLUMNS('Input Wonen'!P:R),FALSE),\"\")","v":"Keramisch"}]
[null,null,null,"VA03.t",{"$f":"VLOOKUP(D445,'Input Wonen'!$D$13:$H$151,2,FALSE)","v":"Inloopdouche"},{"$f":"VLOOKUP(D445,'Input Wonen'!$D$13:$H$151,3,FALSE)","v":"Gipsblokken + tegels incl. rvs afvoergoot"},null,"VA03.HNN",{"$f":"IFERROR(VLOOKUP(H445,'Input Wonen'!$J$13:$N$151,COLUMNS('Input Wonen'!J:K),FALSE),\"\")","v":"Inloopdouche"},{"$f":"IFERROR(VLOOKUP(H445,'Input Wonen'!$J$13:$N$151,COLUMNS('Input Wonen'!J:L),FALSE),\"\")","v":"Gipsblokken + tegels incl. rvs afvoergoot"},null,"VA03.E",{"$f":"IFERROR(VLOOKUP(L445,'Input Wonen'!$P$13:$T$151,COLUMNS('Input Wonen'!P:Q),FALSE),\"\")","v":"Inloopdouche"},{"$f":"IFERROR(VLOOKUP(L445,'Input Wonen'!$P$13:$T$151,COLUMNS('Input Wonen'!P:R),FALSE),\"\")","v":"Gipsblokken + tegels incl. rvs afvoergoot"}]
[null,null,null,null,"Overige kosten",null,null,null,"Overige kosten",null,null,null,"Overige kosten"]
[null,null,null,"OK01.t",{"$f":"VLOOKUP(D447,'Input Wonen'!$D$13:$H$165,2,FALSE)","v":"Grondwerk, maatvoering, invoeren en sparingen"},null,null,"OK01.HNN",{"$f":"VLOOKUP(H447,'Input Wonen'!$J$13:$N$165,2,FALSE)","v":"Grondwerk, maatvoering, invoeren en sparingen"},null,null,"OK01.E",{"$f":"VLOOKUP(H447,'Input Wonen'!$J$13:$N$165,2,FALSE)","v":"Grondwerk, maatvoering, invoeren en sparingen"}]
[null,null,null,"OK02.t",{"$f":"VLOOKUP(D448,'Input Wonen'!$D$13:$H$165,2,FALSE)","v":"Gevelsteiger"},null,null,"OK02.HNN",{"$f":"VLOOKUP(H448,'Input Wonen'!$J$13:$N$165,2,FALSE)","v":"Gevelsteiger"},null,null,"OK02.E",{"$f":"VLOOKUP(H448,'Input Wonen'!$J$13:$N$165,2,FALSE)","v":"Gevelsteiger"}]
[null,null,null,"OK03.t",{"$f":"VLOOKUP(D449,'Input Wonen'!$D$13:$H$165,2,FALSE)","v":"Dakvalbeveiliging en inplakken van doorvoeren"},null,null,"OK03.HNN",{"$f":"VLOOKUP(H449,'Input Wonen'!$J$13:$N$165,2,FALSE)","v":"Dakvalbeveiliging en inplakken van doorvoeren"},null,null,"OK03.E",{"$f":"VLOOKUP(H449,'Input Wonen'!$J$13:$N$165,2,FALSE)","v":"Dakvalbeveiliging en inplakken van doorvoeren"}]
[null,null,null,"OK04.t",{"$f":"VLOOKUP(D450,'Input Wonen'!$D$13:$H$165,2,FALSE)","v":"Afbouwwerkzaamheden (klein timmerwerk, schilderwerk)"},null,null,"OK04.HNN",{"$f":"VLOOKUP(H450,'Input Wonen'!$J$13:$N$165,2,FALSE)","v":"Afbouwwerkzaamheden (klein timmerwerk, schilderwerk)"},null,null,"OK04.E",{"$f":"VLOOKUP(H450,'Input Wonen'!$J$13:$N$165,2,FALSE)","v":"Afbouwwerkzaamheden (klein timmerwerk, schilderwerk)"}]
[null,null,null,"OK05.t",{"$f":"VLOOKUP(D451,'Input Wonen'!$D$13:$H$165,2,FALSE)","v":"Bouwkundige voorzieningen ten behoeve van installaties"},null,null,"OK05.HNN",{"$f":"VLOOKUP(H451,'Input Wonen'!$J$13:$N$165,2,FALSE)","v":"Bouwkundige voorzieningen ten behoeve van installaties"},null,null,"OK05.E",{"$f":"VLOOKUP(H451,'Input Wonen'!$J$13:$N$165,2,FALSE)","v":"Bouwkundige voorzieningen ten behoeve van installaties"}]
[null,null,null,"OK09b.t",{"$f":"VLOOKUP(D452,'Input Wonen'!$D$13:$H$174,2,FALSE)","v":"Installaties (E, W & klimaat) woonschijf"},null,null,"OK09b.HNN",{"$f":"VLOOKUP(H452,'Input Wonen'!$J$13:$N$174,2,FALSE)","v":"Installaties (E, W & klimaat) woonschijf"},null,null,"OK09b.E",{"$f":"VLOOKUP(H452,'Input Wonen'!$J$13:$N$174,2,FALSE)","v":"Installaties (E, W & klimaat) woonschijf"}]
[]
[]
[null,null,null,null,"Traditioneel (RVO Referentieprojecten)",null,null,null,"Het Nieuwe Normaal",null,null,null,"Het Nieuwe Normaal ambitieus"]
[]
[null,null,null,null,"WONEN",null,null,null,"WONEN",null,null,null,"WONEN"]
[]
[]
[]
[]
[]
[null,null,null,null,null,null,null,{"$f":"0.696-I463","v":0.61049999999999993},{"$f":"0.095-0.0095","v":8.5500000000000007E-2}]
[]
[]
[]
[]
[]
[]
[null,null,null,null,"Toren",null,null,null,"Toren",null,null,null,"Toren"]
[null,null,null,null,"Element","Materialisatie",null,null,"Element","Materialisatie",null,null,"Element","Materialisatie"]
[]
[null,null,null,null,"Fundering",null,null,null,"Fundering",null,null,null,"Fundering"]
[null,null,null,"FU14.t",{"$f":"VLOOKUP(D474,'Input Wonen'!$D$13:$H$151,2,FALSE)","v":"Funderingspaal, ⌀ 500mm; l=25,0m"},{"$f":"VLOOKUP(D474,'Input Wonen'!$D$13:$H$151,3,FALSE)","v":"Schroefpaal; beton, in het werk gestort, C20/25,CEMIII; incl.wapening"},null,"FU14.HNN",{"$f":"IFERROR(VLOOKUP(H474,'Input Wonen'!$J$13:$N$151,COLUMNS('Input Wonen'!J:K),FALSE),\"\")","v":"Funderingspaal, ⌀ 500mm; l=25,0m"},{"$f":"IFERROR(VLOOKUP(H474,'Input Wonen'!$J$13:$N$151,COLUMNS('Input Wonen'!J:L),FALSE),\"\")","v":"Beton met 56% aan secundair aandeel (UMC)"},null,"FU14.E",{"$f":"IFERROR(VLOOKUP(L474,'Input Wonen'!$P$13:$T$151,COLUMNS('Input Wonen'!P:Q),FALSE),\"\")","v":"Funderingspaal, ⌀ 500mm; l=25,0m"},{"$f":"IFERROR(VLOOKUP(L474,'Input Wonen'!$P$13:$T$151,COLUMNS('Input Wonen'!P:R),FALSE),\"\")","v":"Beton met 56% aan secundair aandeel (UMC)"}]
[null,null,null,"FU13.t",{"$f":"VLOOKUP(D475,'Input Wonen'!$D$13:$H$151,2,FALSE)","v":"Funderingsbalken, 600x600mm"},{"$f":"VLOOKUP(D475,'Input Wonen'!$D$13:$H$151,3,FALSE)","v":"In het werk gestort"},null,"FU13.HNN",{"$f":"IFERROR(VLOOKUP(H475,'Input Wonen'!$J$13:$N$151,COLUMNS('Input Wonen'!J:K),FALSE),\"\")","v":"Funderingsbalken, 600x600mm"},{"$f":"IFERROR(VLOOKUP(H475,'Input Wonen'!$J$13:$N$151,COLUMNS('Input Wonen'!J:L),FALSE),\"\")","v":"Beton met 56% aan secundair aandeel (UMC)"},null,"FU13.E",{"$f":"IFERROR(VLOOKUP(L475,'Input Wonen'!$P$13:$T$151,COLUMNS('Input Wonen'!P:Q),FALSE),\"\")","v":"Funderingsbalken, 600x600mm"},{"$f":"IFERROR(VLOOKUP(L475,'Input Wonen'!$P$13:$T$151,COLUMNS('Input Wonen'!P:R),FALSE),\"\")","v":"Beton met 56% aan secundair aandeel (UMC)"}]
[null,null,null,"FU07.t",{"$f":"VLOOKUP(D476,'Input Wonen'!$D$13:$H$151,2,FALSE)","v":"Opgaand metselwerk"},{"$f":"VLOOKUP(D476,'Input Wonen'!$D$13:$H$151,3,FALSE)","v":"Kalkzandsteen lijmblokken, 100mm"},null,"FU07.HNN",{"$f":"IFERROR(VLOOKUP(H476,'Input Wonen'!$J$13:$N$151,COLUMNS('Input Wonen'!J:K),FALSE),\"\")","v":"Opgaand metselwerk"},{"$f":"IFERROR(VLOOKUP(H476,'Input Wonen'!$J$13:$N$151,COLUMNS('Input Wonen'!J:L),FALSE),\"\")","v":"Kalkzandsteen lijmblokken, 100mm"},null,"FU07.E",{"$f":"IFERROR(VLOOKUP(L476,'Input Wonen'!$P$13:$T$151,COLUMNS('Input Wonen'!P:Q),FALSE),\"\")","v":"Opgaand metselwerk"},{"$f":"IFERROR(VLOOKUP(L476,'Input Wonen'!$P$13:$T$151,COLUMNS('Input Wonen'!P:R),FALSE),\"\")","v":"Kalkzandsteen lijmblokken, 100mm"}]
[null,null,null,"FU05.t",{"$f":"VLOOKUP(D477,'Input Wonen'!$D$13:$H$151,2,FALSE)","v":"Bodemafsluiting, zand"},{"$f":"VLOOKUP(D477,'Input Wonen'!$D$13:$H$151,3,FALSE)","v":"Zand"},null,"FU05.HNN",{"$f":"IFERROR(VLOOKUP(H477,'Input Wonen'!$J$13:$N$151,COLUMNS('Input Wonen'!J:K),FALSE),\"\")","v":"Bodemafsluiting, 100 zand"},{"$f":"IFERROR(VLOOKUP(H477,'Input Wonen'!$J$13:$N$151,COLUMNS('Input Wonen'!J:L),FALSE),\"\")","v":"Zand"},null,"FU05.E",{"$f":"IFERROR(VLOOKUP(L477,'Input Wonen'!$P$13:$T$151,COLUMNS('Input Wonen'!P:Q),FALSE),\"\")","v":"Bodemafsluiting, 100 zand"},{"$f":"IFERROR(VLOOKUP(L477,'Input Wonen'!$P$13:$T$151,COLUMNS('Input Wonen'!P:R),FALSE),\"\")","v":"Zand"}]
[null,null,null,null,"Vloeren",null,null,null,"Vloeren",null,null,null,"Vloeren"]
[null,null,null,"VL25.t",{"$f":"VLOOKUP(D479,'Input Wonen'!$D$13:$H$151,2,FALSE)","v":"BG: kanaalplaatvloer, 260mm incl. isolatie (Rc=3,7)"},{"$f":"VLOOKUP(D479,'Input Wonen'!$D$13:$H$151,3,FALSE)","v":"Kanaalplaatvloer; prefab beton"},null,"VL25.HNN",{"$f":"IFERROR(VLOOKUP(H479,'Input Wonen'!$J$13:$N$151,COLUMNS('Input Wonen'!J:K),FALSE),\"\")","v":"BG: kanaalplaatvloer, 260mm incl. isolatie (Rc=3,7)"},{"$f":"IFERROR(VLOOKUP(H479,'Input Wonen'!$J$13:$N$151,COLUMNS('Input Wonen'!J:L),FALSE),\"\")","v":"Kanaalplaat, remontabel (28% recyclaat)"},null,"VL25.E",{"$f":"IFERROR(VLOOKUP(L479,'Input Wonen'!$P$13:$T$151,COLUMNS('Input Wonen'!P:Q),FALSE),\"\")","v":"BG: kanaalplaatvloer, 320mm incl. isolatie (Rc=3,7)"},{"$f":"IFERROR(VLOOKUP(L479,'Input Wonen'!$P$13:$T$151,COLUMNS('Input Wonen'!P:R),FALSE),\"\")","v":"Kanaalplaat, remontabel (28% recyclaat)"}]
[null,null,null,"VL07.t",{"$f":"VLOOKUP(D480,'Input Wonen'!$D$13:$H$151,2,FALSE)","v":"Dekvloeren, 60mm"},{"$f":"VLOOKUP(D480,'Input Wonen'!$D$13:$H$151,3,FALSE)","v":"Zandcement dekvloer"},null,"VL07.HNN",{"$f":"IFERROR(VLOOKUP(H480,'Input Wonen'!$J$13:$N$151,COLUMNS('Input Wonen'!J:K),FALSE),\"\")","v":"Dekvloeren, 60mm"},{"$f":"IFERROR(VLOOKUP(H480,'Input Wonen'!$J$13:$N$151,COLUMNS('Input Wonen'!J:L),FALSE),\"\")","v":"Fermacell honingraatvloer (op houten vloer)"},null,"VL07.E",{"$f":"IFERROR(VLOOKUP(L480,'Input Wonen'!$P$13:$T$151,COLUMNS('Input Wonen'!P:Q),FALSE),\"\")","v":"Dekvloeren, 60mm"},{"$f":"IFERROR(VLOOKUP(L480,'Input Wonen'!$P$13:$T$151,COLUMNS('Input Wonen'!P:R),FALSE),\"\")","v":"Fermacell honingraatvloer (op houten vloer)"}]
[null,null,null,"VL26.t",{"$f":"VLOOKUP(D481,'Input Wonen'!$D$13:$H$151,2,FALSE)","v":"VV: breedplaatvloer, 270mm incl. druklaag"},{"$f":"VLOOKUP(D481,'Input Wonen'!$D$13:$H$151,3,FALSE)","v":"Breedplaatvloer; incl. druklaag"},null,"VL26.HNN",{"$f":"IFERROR(VLOOKUP(H481,'Input Wonen'!$J$13:$N$151,COLUMNS('Input Wonen'!J:K),FALSE),\"\")","v":"VV: breedplaatvloer, 270mm incl. druklaag"},{"$f":"IFERROR(VLOOKUP(H481,'Input Wonen'!$J$13:$N$151,COLUMNS('Input Wonen'!J:L),FALSE),\"\")","v":"Breedplaatvloer; incl. druklaag (UMC)"},null,"VL26.E",{"$f":"IFERROR(VLOOKUP(L481,'Input Wonen'!$P$13:$T$151,COLUMNS('Input Wonen'!P:Q),FALSE),\"\")","v":"VV: breedplaatvloer, 270mm incl. druklaag"},{"$f":"IFERROR(VLOOKUP(L481,'Input Wonen'!$P$13:$T$151,COLUMNS('Input Wonen'!P:R),FALSE),\"\")","v":"Breedplaatvloer; incl. druklaag (UMC)"}]
[null,null,null,null,null,null,null,null,null,null,null,"VL05.E",{"$f":"IFERROR(VLOOKUP(L482,'Input Wonen'!$P$13:$T$151,COLUMNS('Input Wonen'!P:Q),FALSE),\"\")","v":"VV: CLT incl. dekvloer"},{"$f":"IFERROR(VLOOKUP(L482,'Input Wonen'!$P$13:$T$151,COLUMNS('Input Wonen'!P:R),FALSE),\"\")","v":"CLT verdiepingsvloer "}]
[null,null,null,"VL07.t",{"$f":"VLOOKUP(D483,'Input Wonen'!$D$13:$H$151,2,FALSE)","v":"Dekvloeren, 60mm"},{"$f":"VLOOKUP(D483,'Input Wonen'!$D$13:$H$151,3,FALSE)","v":"Zandcement dekvloer"},null,"VL07.HNN",{"$f":"IFERROR(VLOOKUP(H483,'Input Wonen'!$J$13:$N$151,COLUMNS('Input Wonen'!J:K),FALSE),\"\")","v":"Dekvloeren, 60mm"},{"$f":"IFERROR(VLOOKUP(H483,'Input Wonen'!$J$13:$N$151,COLUMNS('Input Wonen'!J:L),FALSE),\"\")","v":"Fermacell honingraatvloer (op houten vloer)"},null,"VL07.E",{"$f":"IFERROR(VLOOKUP(L483,'Input Wonen'!$P$13:$T$151,COLUMNS('Input Wonen'!P:Q),FALSE),\"\")","v":"Dekvloeren, 60mm"},{"$f":"IFERROR(VLOOKUP(L483,'Input Wonen'!$P$13:$T$151,COLUMNS('Input Wonen'!P:R),FALSE),\"\")","v":"Fermacell honingraatvloer (op houten vloer)"}]
[null,null,null,"VL03.t",{"$f":"VLOOKUP(D484,'Input Wonen'!$D$13:$H$151,2,FALSE)","v":"Vloertegelwerk toilet"},{"$f":"VLOOKUP(D484,'Input Wonen'!$D$13:$H$151,3,FALSE)","v":"Keramische tegels, geglazuurd/gelijmd"},null,"VL03.HNN",{"$f":"IFERROR(VLOOKUP(H484,'Input Wonen'!$J$13:$N$151,COLUMNS('Input Wonen'!J:K),FALSE),\"\")","v":"Vloertegelwerk toilet"},{"$f":"IFERROR(VLOOKUP(H484,'Input Wonen'!$J$13:$N$151,COLUMNS('Input Wonen'!J:L),FALSE),\"\")","v":"Mosa C2C vloertegels"},null,"VL03.E",{"$f":"IFERROR(VLOOKUP(L484,'Input Wonen'!$P$13:$T$151,COLUMNS('Input Wonen'!P:Q),FALSE),\"\")","v":"Vloertegelwerk toilet"},{"$f":"IFERROR(VLOOKUP(L484,'Input Wonen'!$P$13:$T$151,COLUMNS('Input Wonen'!P:R),FALSE),\"\")","v":"Mosa C2C vloertegels (losmaakbaar)"}]
[null,null,null,"VL04.t",{"$f":"VLOOKUP(D485,'Input Wonen'!$D$13:$H$151,2,FALSE)","v":"Vloertegelwerk badkamer"},{"$f":"VLOOKUP(D485,'Input Wonen'!$D$13:$H$151,3,FALSE)","v":"Keramische tegels, geglazuurd/gelijmd"},null,"VL04.HNN",{"$f":"IFERROR(VLOOKUP(H485,'Input Wonen'!$J$13:$N$151,COLUMNS('Input Wonen'!J:K),FALSE),\"\")","v":"Vloertegelwerk badkamer"},{"$f":"IFERROR(VLOOKUP(H485,'Input Wonen'!$J$13:$N$151,COLUMNS('Input Wonen'!J:L),FALSE),\"\")","v":"Mosa C2C vloertegels"},null,"VL04.E",{"$f":"IFERROR(VLOOKUP(L485,'Input Wonen'!$P$13:$T$151,COLUMNS('Input Wonen'!P:Q),FALSE),\"\")","v":"Vloertegelwerk badkamer"},{"$f":"IFERROR(VLOOKUP(L485,'Input Wonen'!$P$13:$T$151,COLUMNS('Input Wonen'!P:R),FALSE),\"\")","v":"Mosa C2C vloertegels (losmaakbaar)"}]
[null,null,null,"VL22.t",{"$f":"VLOOKUP(D486,'Input Wonen'!$D$13:$H$151,2,FALSE)","v":"Plafondafwerking, verlaagd plafond"},{"$f":"VLOOKUP(D486,'Input Wonen'!$D$13:$H$151,3,FALSE)","v":"Glaswoltegels"},null,"VL22.HNN",{"$f":"IFERROR(VLOOKUP(H486,'Input Wonen'!$J$13:$N$151,COLUMNS('Input Wonen'!J:K),FALSE),\"\")","v":"Plafondafwerking"},{"$f":"IFERROR(VLOOKUP(H486,'Input Wonen'!$J$13:$N$151,COLUMNS('Input Wonen'!J:L),FALSE),\"\")","v":"Glaswoltegels"},null,"VL22.E",{"$f":"IFERROR(VLOOKUP(L486,'Input Wonen'!$P$13:$T$151,COLUMNS('Input Wonen'!P:Q),FALSE),\"\")","v":"Plafondafwerking"},{"$f":"IFERROR(VLOOKUP(L486,'Input Wonen'!$P$13:$T$151,COLUMNS('Input Wonen'!P:R),FALSE),\"\")","v":"Glaswoltegels"}]
[null,null,null,null,"Draagconstructie",null,null,null,"Draagconstructie",null,null,null,"Draagconstructie"]
[null,null,null,"DR01.t",{"$f":"VLOOKUP(D488,'Input Wonen'!$D$13:$H$151,2,FALSE)","v":"Betonmortel"},{"$f":"VLOOKUP(D488,'Input Wonen'!$D$13:$H$151,3,FALSE)","v":"C20/C25,XC1,S3; 0% betongranulaat"},null,"DR01.HNN",{"$f":"IFERROR(VLOOKUP(H488,'Input Wonen'!$J$13:$N$151,COLUMNS('Input Wonen'!J:K),FALSE),\"\")","v":"Betonmortel"},{"$f":"IFERROR(VLOOKUP(H488,'Input Wonen'!$J$13:$N$151,COLUMNS('Input Wonen'!J:L),FALSE),\"\")","v":"C20/C25,XC1,S3; 20% betongranulaat"},null,"DR01.E",{"$f":"IFERROR(VLOOKUP(L488,'Input Wonen'!$P$13:$T$151,COLUMNS('Input Wonen'!P:Q),FALSE),\"\")","v":"Betonmortel"},{"$f":"IFERROR(VLOOKUP(L488,'Input Wonen'!$P$13:$T$151,COLUMNS('Input Wonen'!P:R),FALSE),\"\")","v":"C20/C25,XC1,S3; 56% betongranulaat"}]
[null,null,null,"DR02.t",{"$f":"VLOOKUP(D489,'Input Wonen'!$D$13:$H$151,2,FALSE)","v":"Wapeningsstaal"},{"$f":"VLOOKUP(D489,'Input Wonen'!$D$13:$H$151,3,FALSE)","v":"Staal"},null,"DR02.HNN",{"$f":"IFERROR(VLOOKUP(H489,'Input Wonen'!$J$13:$N$151,COLUMNS('Input Wonen'!J:K),FALSE),\"\")","v":"Wapeningsstaal"},{"$f":"IFERROR(VLOOKUP(H489,'Input Wonen'!$J$13:$N$151,COLUMNS('Input Wonen'!J:L),FALSE),\"\")","v":"Staal"},null,"DR02.E",{"$f":"IFERROR(VLOOKUP(L489,'Input Wonen'!$P$13:$T$151,COLUMNS('Input Wonen'!P:Q),FALSE),\"\")","v":"Wapeningsstaal"},{"$f":"IFERROR(VLOOKUP(L489,'Input Wonen'!$P$13:$T$151,COLUMNS('Input Wonen'!P:R),FALSE),\"\")","v":"Staal"}]
[null,null,null,"DR03.t",{"$f":"VLOOKUP(D490,'Input Wonen'!$D$13:$H$151,2,FALSE)","v":"Zwaar constructiestaal"},{"$f":"VLOOKUP(D490,'Input Wonen'!$D$13:$H$151,3,FALSE)","v":"7.820 kg/m3, incl. conservering"},null,"DR03.HNN",{"$f":"IFERROR(VLOOKUP(H490,'Input Wonen'!$J$13:$N$151,COLUMNS('Input Wonen'!J:K),FALSE),\"\")","v":"Zwaar constructiestaal"},{"$f":"IFERROR(VLOOKUP(H490,'Input Wonen'!$J$13:$N$151,COLUMNS('Input Wonen'!J:L),FALSE),\"\")","v":"7.820 kg/m3, incl. conservering"},null,"DR03.E",{"$f":"IFERROR(VLOOKUP(L490,'Input Wonen'!$P$13:$T$151,COLUMNS('Input Wonen'!P:Q),FALSE),\"\")","v":"Zwaar constructiestaal"},{"$f":"IFERROR(VLOOKUP(L490,'Input Wonen'!$P$13:$T$151,COLUMNS('Input Wonen'!P:R),FALSE),\"\")","v":"7.820 kg/m3, incl. conservering"}]
[null,null,null,null,"Gevel",null,null,null,"Gevel",null,null,null,"Gevel"]
[null,null,null,"GE29.t",{"$f":"VLOOKUP(D492,'Input Wonen'!$D$13:$H$151,2,FALSE)","v":"Gevelkozijnen; incl. HR++ beglazing"},{"$f":"VLOOKUP(D492,'Input Wonen'!$D$13:$H$151,3,FALSE)","v":"Aluminium"},null,"GE29.HNN",{"$f":"IFERROR(VLOOKUP(H492,'Input Wonen'!$J$13:$N$151,COLUMNS('Input Wonen'!J:K),FALSE),\"\")","v":"Gevelkozijnen; incl. HR++ beglazing"},{"$f":"IFERROR(VLOOKUP(H492,'Input Wonen'!$J$13:$N$151,COLUMNS('Input Wonen'!J:L),FALSE),\"\")","v":"Aluminium; 75% recyclaat (Hydro CIRCAL 75R)"},null,"GE29.E",{"$f":"IFERROR(VLOOKUP(L492,'Input Wonen'!$P$13:$T$151,COLUMNS('Input Wonen'!P:Q),FALSE),\"\")","v":"Gevelkozijnen; incl. Isomax beglazing"},{"$f":"IFERROR(VLOOKUP(L492,'Input Wonen'!$P$13:$T$151,COLUMNS('Input Wonen'!P:R),FALSE),\"\")","v":"Aluminium; 75% recyclaat (Hydro CIRCAL 75R)"}]
[null,null,null,"GE04.t",{"$f":"VLOOKUP(D493,'Input Wonen'!$D$13:$H$151,2,FALSE)","v":"Vensterbanken"},{"$f":"VLOOKUP(D493,'Input Wonen'!$D$13:$H$151,3,FALSE)","v":"Composietsteen "},null,"GE04.HNN",{"$f":"IFERROR(VLOOKUP(H493,'Input Wonen'!$J$13:$N$151,COLUMNS('Input Wonen'!J:K),FALSE),\"\")","v":"Vensterbanken"},{"$f":"IFERROR(VLOOKUP(H493,'Input Wonen'!$J$13:$N$151,COLUMNS('Input Wonen'!J:L),FALSE),\"\")","v":"Composietsteen"},null,"GE04.E",{"$f":"IFERROR(VLOOKUP(L493,'Input Wonen'!$P$13:$T$151,COLUMNS('Input Wonen'!P:Q),FALSE),\"\")","v":"Vensterbanken"},{"$f":"IFERROR(VLOOKUP(L493,'Input Wonen'!$P$13:$T$151,COLUMNS('Input Wonen'!P:R),FALSE),\"\")","v":"Composietsteen"}]
[null,null,null,"GE22.t",{"$f":"VLOOKUP(D494,'Input Wonen'!$D$13:$H$151,2,FALSE)","v":"Lateien"},{"$f":"VLOOKUP(D494,'Input Wonen'!$D$13:$H$151,3,FALSE)","v":"Prefab beton"},null,"GE22.HNN",{"$f":"IFERROR(VLOOKUP(H494,'Input Wonen'!$J$13:$N$151,COLUMNS('Input Wonen'!J:K),FALSE),\"\")","v":"Lateien"},{"$f":"IFERROR(VLOOKUP(H494,'Input Wonen'!$J$13:$N$151,COLUMNS('Input Wonen'!J:L),FALSE),\"\")","v":"Prefab beton"},null,"GE22.E",{"$f":"IFERROR(VLOOKUP(L494,'Input Wonen'!$P$13:$T$151,COLUMNS('Input Wonen'!P:Q),FALSE),\"\")","v":"Lateien"},{"$f":"IFERROR(VLOOKUP(L494,'Input Wonen'!$P$13:$T$151,COLUMNS('Input Wonen'!P:R),FALSE),\"\")","v":"Prefab beton"}]
[null,null,null,"GE32.t",{"$f":"VLOOKUP(D495,'Input Wonen'!$D$13:$H$151,2,FALSE)","v":"Waterslagen"},{"$f":"VLOOKUP(D495,'Input Wonen'!$D$13:$H$151,3,FALSE)","v":"Aluminium; gemoffeld"},null,"GE32.HNN",{"$f":"IFERROR(VLOOKUP(H495,'Input Wonen'!$J$13:$N$151,COLUMNS('Input Wonen'!J:K),FALSE),\"\")","v":"Waterslagen"},{"$f":"IFERROR(VLOOKUP(H495,'Input Wonen'!$J$13:$N$151,COLUMNS('Input Wonen'!J:L),FALSE),\"\")","v":"Aluminium; gemoffeld"},null,"GE32.E",{"$f":"IFERROR(VLOOKUP(L495,'Input Wonen'!$P$13:$T$151,COLUMNS('Input Wonen'!P:Q),FALSE),\"\")","v":"Waterslagen"},{"$f":"IFERROR(VLOOKUP(L495,'Input Wonen'!$P$13:$T$151,COLUMNS('Input Wonen'!P:R),FALSE),\"\")","v":"Aluminium; gemoffeld"}]
[null,null,null,"GE34.t",{"$f":"VLOOKUP(D496,'Input Wonen'!$D$13:$H$151,2,FALSE)","v":"Buitendeur; multiplex"},{"$f":"VLOOKUP(D496,'Input Wonen'!$D$13:$H$151,3,FALSE)","v":"Sandwich; 2x multiplex"},null,"GE34.HNN",{"$f":"IFERROR(VLOOKUP(H496,'Input Wonen'!$J$13:$N$151,COLUMNS('Input Wonen'!J:K),FALSE),\"\")","v":"Buitendeur; multiplex"},{"$f":"IFERROR(VLOOKUP(H496,'Input Wonen'!$J$13:$N$151,COLUMNS('Input Wonen'!J:L),FALSE),\"\")","v":"Sandwich; 2x multiplex"},null,"GE34.E",{"$f":"IFERROR(VLOOKUP(L496,'Input Wonen'!$P$13:$T$151,COLUMNS('Input Wonen'!P:Q),FALSE),\"\")","v":"Buitendeur; multiplex"},{"$f":"IFERROR(VLOOKUP(L496,'Input Wonen'!$P$13:$T$151,COLUMNS('Input Wonen'!P:R),FALSE),\"\")","v":"Sandwich; 2x multiplex"}]
[null,null,null,"GE36.t",{"$f":"VLOOKUP(D497,'Input Wonen'!$D$13:$H$151,2,FALSE)","v":"Buitendeur; aluminium"},{"$f":"VLOOKUP(D497,'Input Wonen'!$D$13:$H$151,3,FALSE)","v":"Aluminium, gemoffeld; bekleding volkern"},null,"GE36.HNN",{"$f":"IFERROR(VLOOKUP(H497,'Input Wonen'!$J$13:$N$151,COLUMNS('Input Wonen'!J:K),FALSE),\"\")","v":"Buitendeur; aluminium"},{"$f":"IFERROR(VLOOKUP(H497,'Input Wonen'!$J$13:$N$151,COLUMNS('Input Wonen'!J:L),FALSE),\"\")","v":"Aluminium, gemoffeld; bekleding volkern"},null,"GE36.E",{"$f":"IFERROR(VLOOKUP(L497,'Input Wonen'!$P$13:$T$151,COLUMNS('Input Wonen'!P:Q),FALSE),\"\")","v":"Buitendeur; aluminium"},{"$f":"IFERROR(VLOOKUP(L497,'Input Wonen'!$P$13:$T$151,COLUMNS('Input Wonen'!P:R),FALSE),\"\")","v":"Aluminium, gemoffeld; bekleding volkern"}]
[null,null,null,"GE24.t",{"$f":"VLOOKUP(D498,'Input Wonen'!$D$13:$H$151,2,FALSE)","v":"Binnenspouwblad, 250mm (bruto)"},{"$f":"VLOOKUP(D498,'Input Wonen'!$D$13:$H$151,3,FALSE)","v":"I.h.w.g. beton"},null,"GE24.HNN",{"$f":"IFERROR(VLOOKUP(H498,'Input Wonen'!$J$13:$N$151,COLUMNS('Input Wonen'!J:K),FALSE),\"\")","v":"Binnenspouwblad, 250mm (bruto)"},{"$f":"IFERROR(VLOOKUP(H498,'Input Wonen'!$J$13:$N$151,COLUMNS('Input Wonen'!J:L),FALSE),\"\")","v":"I.h.w.g. beton (UMC)"},null,"GE24.HNN",{"$f":"I498","v":"Binnenspouwblad, 250mm (bruto)"},{"$f":"J498","v":"I.h.w.g. beton (UMC)"}]
[null,null,null,null,null,null,null,null,null,null,null,"GE24.E",{"$f":"IFERROR(VLOOKUP(L499,'Input Wonen'!$P$13:$T$151,COLUMNS('Input Wonen'!P:Q),FALSE),\"\")","v":"Binnenspouwblad, CLT"},{"$f":"IFERROR(VLOOKUP(L499,'Input Wonen'!$P$13:$T$151,COLUMNS('Input Wonen'!P:R),FALSE),\"\")","v":"CLT wanden"}]
[null,null,null,"GE25.t",{"$f":"VLOOKUP(D500,'Input Wonen'!$D$13:$H$151,2,FALSE)","v":"Binnenspouwblad; niet dragend, 250mm (bruto)"},{"$f":"VLOOKUP(D500,'Input Wonen'!$D$13:$H$151,3,FALSE)","v":"HSB element incl. isolatie en beplating"},null,"GE25.HNN",{"$f":"IFERROR(VLOOKUP(H500,'Input Wonen'!$J$13:$N$151,COLUMNS('Input Wonen'!J:K),FALSE),\"\")","v":"Binnenspouwblad; niet dragend, 250mm (bruto)"},{"$f":"IFERROR(VLOOKUP(H500,'Input Wonen'!$J$13:$N$151,COLUMNS('Input Wonen'!J:L),FALSE),\"\")","v":"HSB element incl. isolatie en beplating"},null,"GE25.E",{"$f":"IFERROR(VLOOKUP(L500,'Input Wonen'!$P$13:$T$151,COLUMNS('Input Wonen'!P:Q),FALSE),\"\")","v":"Binnenspouwblad; niet dragend HSB (bruto)"},{"$f":"IFERROR(VLOOKUP(L500,'Input Wonen'!$P$13:$T$151,COLUMNS('Input Wonen'!P:R),FALSE),\"\")","v":"HSB element incl. Isovlas isolatie"}]
[null,null,null,"GE09.t",{"$f":"VLOOKUP(D501,'Input Wonen'!$D$13:$H$151,2,FALSE)","v":"Buitenspouwblad, 100mm"},{"$f":"VLOOKUP(D501,'Input Wonen'!$D$13:$H$151,3,FALSE)","v":"Baksteenmetselwerk"},null,"GE09.HNN",{"$f":"IFERROR(VLOOKUP(H501,'Input Wonen'!$J$13:$N$151,COLUMNS('Input Wonen'!J:K),FALSE),\"\")","v":"Buitenspouwblad"},{"$f":"IFERROR(VLOOKUP(H501,'Input Wonen'!$J$13:$N$151,COLUMNS('Input Wonen'!J:L),FALSE),\"\")","v":"Ecobrick Wienerberger"},null,"GE09.E",{"$f":"IFERROR(VLOOKUP(L501,'Input Wonen'!$P$13:$T$151,COLUMNS('Input Wonen'!P:Q),FALSE),\"\")","v":"Buitenspouwblad"},{"$f":"IFERROR(VLOOKUP(L501,'Input Wonen'!$P$13:$T$151,COLUMNS('Input Wonen'!P:R),FALSE),\"\")","v":"Houten gevelbekleding; Meranti delen"}]
[null,null,null,"GE26.t",{"$f":"VLOOKUP(D502,'Input Wonen'!$D$13:$H$151,2,FALSE)","v":"Isolatielagen, Rc=4,7"},{"$f":"VLOOKUP(D502,'Input Wonen'!$D$13:$H$151,3,FALSE)","v":"Glaswolplaten, MWA 2012"},null,"GE26.HNN",{"$f":"IFERROR(VLOOKUP(H502,'Input Wonen'!$J$13:$N$151,COLUMNS('Input Wonen'!J:K),FALSE),\"\")","v":"Isolatielagen, Rc=4,7"},{"$f":"IFERROR(VLOOKUP(H502,'Input Wonen'!$J$13:$N$151,COLUMNS('Input Wonen'!J:L),FALSE),\"\")","v":"Isovlas plaat, PN160mm"},null,"GE26.E",{"$f":"IFERROR(VLOOKUP(L502,'Input Wonen'!$P$13:$T$151,COLUMNS('Input Wonen'!P:Q),FALSE),\"\")","v":"Isolatielagen, Rc=4,7"},{"$f":"IFERROR(VLOOKUP(L502,'Input Wonen'!$P$13:$T$151,COLUMNS('Input Wonen'!P:R),FALSE),\"\")","v":"Isovlas plaat, PN160mm"}]
[null,null,null,null,"Daken",null,null,null,"Daken",null,null,null,"Daken"]
[null,null,null,"DA02.t",{"$f":"VLOOKUP(D504,'Input Wonen'!$D$13:$H$151,2,FALSE)","v":"Dakvloer: breedplaatvloer, 270mm incl. druklaag"},{"$f":"VLOOKUP(D504,'Input Wonen'!$D$13:$H$151,3,FALSE)","v":"Breedplaatvloer; incl. druklaag "},null,"DA02.HNN",{"$f":"IFERROR(VLOOKUP(H504,'Input Wonen'!$J$13:$N$151,COLUMNS('Input Wonen'!J:K),FALSE),\"\")","v":"Dakvloer: breedplaatvloer, 270mm incl. druklaag"},{"$f":"IFERROR(VLOOKUP(H504,'Input Wonen'!$J$13:$N$151,COLUMNS('Input Wonen'!J:L),FALSE),\"\")","v":"Breedplaatvloer; incl. druklaag (UMC)"},null,"DA18.E",{"$f":"IFERROR(VLOOKUP(L504,'Input Wonen'!$P$13:$T$151,COLUMNS('Input Wonen'!P:Q),FALSE),\"\")","v":"Dakconstructie, plat dak"},{"$f":"IFERROR(VLOOKUP(L504,'Input Wonen'!$P$13:$T$151,COLUMNS('Input Wonen'!P:R),FALSE),\"\")","v":"CLT excl. isolatie"}]
[null,null,null,"DA16.t",{"$f":"VLOOKUP(D505,'Input Wonen'!$D$13:$H$151,2,FALSE)","v":"Isolatielagen; plat dak; Rc=6,3"},{"$f":"VLOOKUP(D505,'Input Wonen'!$D$13:$H$151,3,FALSE)","v":"EPS"},null,"DA16.HNN",{"$f":"IFERROR(VLOOKUP(H505,'Input Wonen'!$J$13:$N$151,COLUMNS('Input Wonen'!J:K),FALSE),\"\")","v":"Isolatielagen; plat dak; Rc=6,3"},{"$f":"IFERROR(VLOOKUP(H505,'Input Wonen'!$J$13:$N$151,COLUMNS('Input Wonen'!J:L),FALSE),\"\")","v":"Houtvezel vlakke isolatieplaten"},null,"DA16.E",{"$f":"IFERROR(VLOOKUP(L505,'Input Wonen'!$P$13:$T$151,COLUMNS('Input Wonen'!P:Q),FALSE),\"\")","v":"Isolatielagen; plat dak; Rc=6,3"},{"$f":"IFERROR(VLOOKUP(L505,'Input Wonen'!$P$13:$T$151,COLUMNS('Input Wonen'!P:R),FALSE),\"\")","v":"Houtvezel vlakke isolatieplaten"}]
[null,null,null,"DA09.t",{"$f":"VLOOKUP(D506,'Input Wonen'!$D$13:$H$151,2,FALSE)","v":"Dakbedekking"},{"$f":"VLOOKUP(D506,'Input Wonen'!$D$13:$H$151,3,FALSE)","v":"Bitumen, gemod. eenlaags 4,3mm"},null,"DA09.HNN",{"$f":"IFERROR(VLOOKUP(H506,'Input Wonen'!$J$13:$N$151,COLUMNS('Input Wonen'!J:K),FALSE),\"\")","v":"Dakbedekking"},{"$f":"IFERROR(VLOOKUP(H506,'Input Wonen'!$J$13:$N$151,COLUMNS('Input Wonen'!J:L),FALSE),\"\")","v":"EPDM losmaakbare dakbedekking"},null,"DA09.E",{"$f":"IFERROR(VLOOKUP(L506,'Input Wonen'!$P$13:$T$151,COLUMNS('Input Wonen'!P:Q),FALSE),\"\")","v":"Dakbedekking"},{"$f":"IFERROR(VLOOKUP(L506,'Input Wonen'!$P$13:$T$151,COLUMNS('Input Wonen'!P:R),FALSE),\"\")","v":"EPDM losmaakbare dakbedekking"}]
[null,null,null,"DA43.t",{"$f":"VLOOKUP(D507,'Input Wonen'!$D$13:$H$151,2,FALSE)","v":"Dakrand binnenblad, 100mm"},{"$f":"VLOOKUP(D507,'Input Wonen'!$D$13:$H$151,3,FALSE)","v":"Cellenbeton blokken, XellaYtong"},null,"DA43.HNN",{"$f":"IFERROR(VLOOKUP(H507,'Input Wonen'!$J$13:$N$151,COLUMNS('Input Wonen'!J:K),FALSE),\"\")","v":"Dakrand binnenblad, 100mm"},{"$f":"IFERROR(VLOOKUP(H507,'Input Wonen'!$J$13:$N$151,COLUMNS('Input Wonen'!J:L),FALSE),\"\")","v":"Cellenbeton blokken, XellaYtong"},null,"DA43.E",{"$f":"IFERROR(VLOOKUP(L507,'Input Wonen'!$P$13:$T$151,COLUMNS('Input Wonen'!P:Q),FALSE),\"\")","v":"Dakrand binnenblad, 100mm"},{"$f":"IFERROR(VLOOKUP(L507,'Input Wonen'!$P$13:$T$151,COLUMNS('Input Wonen'!P:R),FALSE),\"\")","v":"HSB element incl. Isovlas isolatie"}]
[null,null,null,"GE09.t",{"$f":"VLOOKUP(D508,'Input Wonen'!$D$13:$H$151,2,FALSE)","v":"Buitenspouwblad, 100mm"},{"$f":"VLOOKUP(D508,'Input Wonen'!$D$13:$H$151,3,FALSE)","v":"Baksteenmetselwerk"},null,"GE09.HNN",{"$f":"IFERROR(VLOOKUP(H508,'Input Wonen'!$J$13:$N$151,COLUMNS('Input Wonen'!J:K),FALSE),\"\")","v":"Buitenspouwblad"},{"$f":"IFERROR(VLOOKUP(H508,'Input Wonen'!$J$13:$N$151,COLUMNS('Input Wonen'!J:L),FALSE),\"\")","v":"Ecobrick Wienerberger"},null,"GE09.E",{"$f":"IFERROR(VLOOKUP(L508,'Input Wonen'!$P$13:$T$151,COLUMNS('Input Wonen'!P:Q),FALSE),\"\")","v":"Buitenspouwblad"},{"$f":"IFERROR(VLOOKUP(L508,'Input Wonen'!$P$13:$T$151,COLUMNS('Input Wonen'!P:R),FALSE),\"\")","v":"Houten gevelbekleding; Meranti delen"}]
[null,null,null,"DA04.t",{"$f":"VLOOKUP(D509,'Input Wonen'!$D$13:$H$151,2,FALSE)","v":"Dakafwerking"},{"$f":"VLOOKUP(D509,'Input Wonen'!$D$13:$H$151,3,FALSE)","v":"Daktrim; aluminium gemoffeld"},null,"DA04.HNN",{"$f":"IFERROR(VLOOKUP(H509,'Input Wonen'!$J$13:$N$151,COLUMNS('Input Wonen'!J:K),FALSE),\"\")","v":"Dakafwerking"},{"$f":"IFERROR(VLOOKUP(H509,'Input Wonen'!$J$13:$N$151,COLUMNS('Input Wonen'!J:L),FALSE),\"\")","v":"Daktrim; aluminium gemoffeld"},null,"DA04.E",{"$f":"IFERROR(VLOOKUP(L509,'Input Wonen'!$P$13:$T$151,COLUMNS('Input Wonen'!P:Q),FALSE),\"\")","v":"Dakafwerking"},{"$f":"IFERROR(VLOOKUP(L509,'Input Wonen'!$P$13:$T$151,COLUMNS('Input Wonen'!P:R),FALSE),\"\")","v":"Daktrim; aluminium gemoffeld"}]
[null,null,null,"DA14.t",{"$f":"VLOOKUP(D510,'Input Wonen'!$D$13:$H$151,2,FALSE)","v":"Waterkeringen"},{"$f":"VLOOKUP(D510,'Input Wonen'!$D$13:$H$151,3,FALSE)","v":"Polyetheen; folie"},null,"DA14.HNN",{"$f":"IFERROR(VLOOKUP(H510,'Input Wonen'!$J$13:$N$151,COLUMNS('Input Wonen'!J:K),FALSE),\"\")","v":"Waterkeringen"},{"$f":"IFERROR(VLOOKUP(H510,'Input Wonen'!$J$13:$N$151,COLUMNS('Input Wonen'!J:L),FALSE),\"\")","v":"Polyetheen; folie"},null,"DA14.E",{"$f":"IFERROR(VLOOKUP(L510,'Input Wonen'!$P$13:$T$151,COLUMNS('Input Wonen'!P:Q),FALSE),\"\")","v":"Waterkeringen"},{"$f":"IFERROR(VLOOKUP(L510,'Input Wonen'!$P$13:$T$151,COLUMNS('Input Wonen'!P:R),FALSE),\"\")","v":"Polyetheen; folie"}]
[null,null,null,"DA15.t",{"$f":"VLOOKUP(D511,'Input Wonen'!$D$13:$H$151,2,FALSE)","v":"Dakafwerking"},{"$f":"VLOOKUP(D511,'Input Wonen'!$D$13:$H$151,3,FALSE)","v":"Rubbertegel; ballastlaag"},null,"DA15.HNN",{"$f":"IFERROR(VLOOKUP(H511,'Input Wonen'!$J$13:$N$151,COLUMNS('Input Wonen'!J:K),FALSE),\"\")","v":"Dakafwerking"},{"$f":"IFERROR(VLOOKUP(H511,'Input Wonen'!$J$13:$N$151,COLUMNS('Input Wonen'!J:L),FALSE),\"\")","v":"Rubbertegel; ballastlaag"},null,"DA15.E",{"$f":"IFERROR(VLOOKUP(L511,'Input Wonen'!$P$13:$T$151,COLUMNS('Input Wonen'!P:Q),FALSE),\"\")","v":"Dakafwerking"},{"$f":"IFERROR(VLOOKUP(L511,'Input Wonen'!$P$13:$T$151,COLUMNS('Input Wonen'!P:R),FALSE),\"\")","v":"Rubbertegel; ballastlaag"}]
[null,null,null,null,"Binnenwanden",null,null,null,"Binnenwanden",null,null,null,"Binnenwanden"]
[null,null,null,"GE27.t",{"$f":"VLOOKUP(D513,'Input Wonen'!$D$13:$H$151,2,FALSE)","v":"Dragende binnenwanden, 250mm; "},{"$f":"VLOOKUP(D513,'Input Wonen'!$D$13:$H$151,3,FALSE)","v":"I.h.w.g. beton"},null,"GE27.HNN",{"$f":"IFERROR(VLOOKUP(H513,'Input Wonen'!$J$13:$N$151,COLUMNS('Input Wonen'!J:K),FALSE),\"\")","v":"Dragende binnenwanden, 250mm; "},{"$f":"IFERROR(VLOOKUP(H513,'Input Wonen'!$J$13:$N$151,COLUMNS('Input Wonen'!J:L),FALSE),\"\")","v":"I.h.w.g. beton (UMC)"},null,"BI01.E",{"$f":"IFERROR(VLOOKUP(L513,'Input Wonen'!$P$13:$T$151,COLUMNS('Input Wonen'!P:Q),FALSE),\"\")","v":"Dragende binnenwanden"},{"$f":"IFERROR(VLOOKUP(L513,'Input Wonen'!$P$13:$T$151,COLUMNS('Input Wonen'!P:R),FALSE),\"\")","v":"I.h.w.g. beton (UMC)"}]
[null,null,null,null,null,null,null,null,null,null,null,"GE27.E",{"$f":"IFERROR(VLOOKUP(L514,'Input Wonen'!$P$13:$T$151,COLUMNS('Input Wonen'!P:Q),FALSE),\"\")","v":"Dragende binnenwanden"},{"$f":"IFERROR(VLOOKUP(L514,'Input Wonen'!$P$13:$T$151,COLUMNS('Input Wonen'!P:R),FALSE),\"\")","v":"CLT wanden"}]
[null,null,null,null,null,null,null,null,null,null,null,"GE27.E",{"$f":"IFERROR(VLOOKUP(L515,'Input Wonen'!$P$13:$T$151,COLUMNS('Input Wonen'!P:Q),FALSE),\"\")","v":"Dragende binnenwanden"},{"$f":"IFERROR(VLOOKUP(L515,'Input Wonen'!$P$13:$T$151,COLUMNS('Input Wonen'!P:R),FALSE),\"\")","v":"CLT wanden"}]
[null,null,null,"BI40.t",{"$f":"VLOOKUP(D516,'Input Wonen'!$D$13:$H$151,2,FALSE)","v":"Binnenwanden, 250mm"},{"$f":"VLOOKUP(D516,'Input Wonen'!$D$13:$H$151,3,FALSE)","v":"Prefab beton"},null,"BI40.HNN",{"$f":"IFERROR(VLOOKUP(H516,'Input Wonen'!$J$13:$N$151,COLUMNS('Input Wonen'!J:K),FALSE),\"\")","v":"Binnenwanden, 250mm"},{"$f":"IFERROR(VLOOKUP(H516,'Input Wonen'!$J$13:$N$151,COLUMNS('Input Wonen'!J:L),FALSE),\"\")","v":"Prefab beton"},null,"BI40.E",{"$f":"IFERROR(VLOOKUP(L516,'Input Wonen'!$P$13:$T$151,COLUMNS('Input Wonen'!P:Q),FALSE),\"\")","v":"Binnenwanden, 250mm"},{"$f":"IFERROR(VLOOKUP(L516,'Input Wonen'!$P$13:$T$151,COLUMNS('Input Wonen'!P:R),FALSE),\"\")","v":"Prefab beton (UMC)"}]
[null,null,null,"GE37.t",{"$f":"VLOOKUP(D517,'Input Wonen'!$D$13:$H$151,2,FALSE)","v":"Isolatielagen, Rc=0,55"},{"$f":"VLOOKUP(D517,'Input Wonen'!$D$13:$H$151,3,FALSE)","v":"XPS"},null,"GE37.HNN",{"$f":"IFERROR(VLOOKUP(H517,'Input Wonen'!$J$13:$N$151,COLUMNS('Input Wonen'!J:K),FALSE),\"\")","v":"Binnenwanden, 35mm"},{"$f":"IFERROR(VLOOKUP(H517,'Input Wonen'!$J$13:$N$151,COLUMNS('Input Wonen'!J:L),FALSE),\"\")","v":"Faay volpaneel"},null,"GE37.E",{"$f":"IFERROR(VLOOKUP(L517,'Input Wonen'!$P$13:$T$151,COLUMNS('Input Wonen'!P:Q),FALSE),\"\")","v":"Binnenwanden, 35mm"},{"$f":"IFERROR(VLOOKUP(L517,'Input Wonen'!$P$13:$T$151,COLUMNS('Input Wonen'!P:R),FALSE),\"\")","v":"Faay volpaneel"}]
[null,null,null,"BI03.t",{"$f":"VLOOKUP(D518,'Input Wonen'!$D$13:$H$151,2,FALSE)","v":"Binnenwanden, 100mm"},{"$f":"VLOOKUP(D518,'Input Wonen'!$D$13:$H$151,3,FALSE)","v":"Kalkzandsteen lijmblokken, 100mm"},null,"BI03.HNN",{"$f":"IFERROR(VLOOKUP(H518,'Input Wonen'!$J$13:$N$151,COLUMNS('Input Wonen'!J:K),FALSE),\"\")","v":"Binnenwanden, 100mm"},{"$f":"IFERROR(VLOOKUP(H518,'Input Wonen'!$J$13:$N$151,COLUMNS('Input Wonen'!J:L),FALSE),\"\")","v":"Faay volpaneel"},null,"BI03.E",{"$f":"IFERROR(VLOOKUP(L518,'Input Wonen'!$P$13:$T$151,COLUMNS('Input Wonen'!P:Q),FALSE),\"\")","v":"Binnenwanden, 100mm"},{"$f":"IFERROR(VLOOKUP(L518,'Input Wonen'!$P$13:$T$151,COLUMNS('Input Wonen'!P:R),FALSE),\"\")","v":"Faay volpaneel"}]
[null,null,null,"BI05.t",{"$f":"VLOOKUP(D519,'Input Wonen'!$D$13:$H$151,2,FALSE)","v":"Binnenwanden, 70mm"},{"$f":"VLOOKUP(D519,'Input Wonen'!$D$13:$H$151,3,FALSE)","v":"Gipsblokken, normale dichtheid"},null,"BI05.HNN",{"$f":"IFERROR(VLOOKUP(H519,'Input Wonen'!$J$13:$N$151,COLUMNS('Input Wonen'!J:K),FALSE),\"\")","v":"Binnenwanden, 70mm"},{"$f":"IFERROR(VLOOKUP(H519,'Input Wonen'!$J$13:$N$151,COLUMNS('Input Wonen'!J:L),FALSE),\"\")","v":"Faay volpaneel"},null,"BI05.E",{"$f":"IFERROR(VLOOKUP(L519,'Input Wonen'!$P$13:$T$151,COLUMNS('Input Wonen'!P:Q),FALSE),\"\")","v":"Binnenwanden, 70mm"},{"$f":"IFERROR(VLOOKUP(L519,'Input Wonen'!$P$13:$T$151,COLUMNS('Input Wonen'!P:R),FALSE),\"\")","v":"Faay volpaneel"}]
[null,null,null,"BI16.t",{"$f":"VLOOKUP(D520,'Input Wonen'!$D$13:$H$151,2,FALSE)","v":"Systeemwanden; gipskartonplaat, 100mm"},{"$f":"VLOOKUP(D520,'Input Wonen'!$D$13:$H$151,3,FALSE)","v":"Dubbel beplaat, 40 mm glaswol"},null,"BI16.HNN",{"$f":"IFERROR(VLOOKUP(H520,'Input Wonen'!$J$13:$N$151,COLUMNS('Input Wonen'!J:K),FALSE),\"\")","v":"Systeemwanden; niet constructief, 100mm"},{"$f":"IFERROR(VLOOKUP(H520,'Input Wonen'!$J$13:$N$151,COLUMNS('Input Wonen'!J:L),FALSE),\"\")","v":"HSB binnenwand element met vlasisolatie"},null,"BI16.E",{"$f":"IFERROR(VLOOKUP(L520,'Input Wonen'!$P$13:$T$151,COLUMNS('Input Wonen'!P:Q),FALSE),\"\")","v":"Binnenwanden, 100mm"},{"$f":"IFERROR(VLOOKUP(L520,'Input Wonen'!$P$13:$T$151,COLUMNS('Input Wonen'!P:R),FALSE),\"\")","v":"Faay volpaneel; dubbel beplaat"}]
[null,null,null,"BI12.t",{"$f":"VLOOKUP(D521,'Input Wonen'!$D$13:$H$151,2,FALSE)","v":"Binnenkozijnen, incl. deuren"},{"$f":"VLOOKUP(D521,'Input Wonen'!$D$13:$H$151,3,FALSE)","v":"Europees naaldhout, geschilderd"},null,"BI12.HNN",{"$f":"IFERROR(VLOOKUP(H521,'Input Wonen'!$J$13:$N$151,COLUMNS('Input Wonen'!J:K),FALSE),\"\")","v":"Binnenkozijnen, incl. deuren"},{"$f":"IFERROR(VLOOKUP(H521,'Input Wonen'!$J$13:$N$151,COLUMNS('Input Wonen'!J:L),FALSE),\"\")","v":"Europees naaldhout, geschilderd"},null,"BI12.E",{"$f":"IFERROR(VLOOKUP(L521,'Input Wonen'!$P$13:$T$151,COLUMNS('Input Wonen'!P:Q),FALSE),\"\")","v":"Binnenkozijnen, incl. deuren"},{"$f":"IFERROR(VLOOKUP(L521,'Input Wonen'!$P$13:$T$151,COLUMNS('Input Wonen'!P:R),FALSE),\"\")","v":"Europees naaldhout, geschilderd"}]
[null,null,null,"BI15.t",{"$f":"VLOOKUP(D522,'Input Wonen'!$D$13:$H$151,2,FALSE)","v":"Binnenkozijnen"},{"$f":"VLOOKUP(D522,'Input Wonen'!$D$13:$H$151,3,FALSE)","v":"Staal; verzinkt+gemoffeld"},null,"BI15.HNN",{"$f":"IFERROR(VLOOKUP(H522,'Input Wonen'!$J$13:$N$151,COLUMNS('Input Wonen'!J:K),FALSE),\"\")","v":"Binnenkozijnen"},{"$f":"IFERROR(VLOOKUP(H522,'Input Wonen'!$J$13:$N$151,COLUMNS('Input Wonen'!J:L),FALSE),\"\")","v":"Staal; verzinkt+gemoffeld"},null,"BI15.E",{"$f":"IFERROR(VLOOKUP(L522,'Input Wonen'!$P$13:$T$151,COLUMNS('Input Wonen'!P:Q),FALSE),\"\")","v":"Binnenkozijnen"},{"$f":"IFERROR(VLOOKUP(L522,'Input Wonen'!$P$13:$T$151,COLUMNS('Input Wonen'!P:R),FALSE),\"\")","v":"Staal; verzinkt+gemoffeld"}]
[null,null,null,"BI17.t",{"$f":"VLOOKUP(D523,'Input Wonen'!$D$13:$H$151,2,FALSE)","v":"Binnenbeglazing"},{"$f":"VLOOKUP(D523,'Input Wonen'!$D$13:$H$151,3,FALSE)","v":"Enkel glas"},null,"BI17.HNN",{"$f":"IFERROR(VLOOKUP(H523,'Input Wonen'!$J$13:$N$151,COLUMNS('Input Wonen'!J:K),FALSE),\"\")","v":"Binnenbeglazing"},{"$f":"IFERROR(VLOOKUP(H523,'Input Wonen'!$J$13:$N$151,COLUMNS('Input Wonen'!J:L),FALSE),\"\")","v":"Enkel glas"},null,"BI17.E",{"$f":"IFERROR(VLOOKUP(L523,'Input Wonen'!$P$13:$T$151,COLUMNS('Input Wonen'!P:Q),FALSE),\"\")","v":"Binnenbeglazing"},{"$f":"IFERROR(VLOOKUP(L523,'Input Wonen'!$P$13:$T$151,COLUMNS('Input Wonen'!P:R),FALSE),\"\")","v":"Enkel glas"}]
[null,null,null,"BI08.t",{"$f":"VLOOKUP(D524,'Input Wonen'!$D$13:$H$151,2,FALSE)","v":"Binnendeuren"},{"$f":"VLOOKUP(D524,'Input Wonen'!$D$13:$H$151,3,FALSE)","v":"Honingraat; vlakke binnendeur"},null,"BI08.HNN",{"$f":"IFERROR(VLOOKUP(H524,'Input Wonen'!$J$13:$N$151,COLUMNS('Input Wonen'!J:K),FALSE),\"\")","v":"Binnendeuren"},{"$f":"IFERROR(VLOOKUP(H524,'Input Wonen'!$J$13:$N$151,COLUMNS('Input Wonen'!J:L),FALSE),\"\")","v":"Honingraat; vlakke binnendeur"},null,"BI08.E",{"$f":"IFERROR(VLOOKUP(L524,'Input Wonen'!$P$13:$T$151,COLUMNS('Input Wonen'!P:Q),FALSE),\"\")","v":"Binnendeuren"},{"$f":"IFERROR(VLOOKUP(L524,'Input Wonen'!$P$13:$T$151,COLUMNS('Input Wonen'!P:R),FALSE),\"\")","v":"Honingraat; vlakke binnendeur"}]
[null,null,null,"BI10.t",{"$f":"VLOOKUP(D525,'Input Wonen'!$D$13:$H$151,2,FALSE)","v":"Binnendorpels"},{"$f":"VLOOKUP(D525,'Input Wonen'!$D$13:$H$151,3,FALSE)","v":"Gegoten composietsteen"},null,"BI10.HNN",{"$f":"IFERROR(VLOOKUP(H525,'Input Wonen'!$J$13:$N$151,COLUMNS('Input Wonen'!J:K),FALSE),\"\")","v":"Binnendorpels"},{"$f":"IFERROR(VLOOKUP(H525,'Input Wonen'!$J$13:$N$151,COLUMNS('Input Wonen'!J:L),FALSE),\"\")","v":"Kunststeen"},null,"BI10.E",{"$f":"IFERROR(VLOOKUP(L525,'Input Wonen'!$P$13:$T$151,COLUMNS('Input Wonen'!P:Q),FALSE),\"\")","v":"Binnendorpels"},{"$f":"IFERROR(VLOOKUP(L525,'Input Wonen'!$P$13:$T$151,COLUMNS('Input Wonen'!P:R),FALSE),\"\")","v":"Kunststeen"}]
[null,null,null,"BI04.t",{"$f":"VLOOKUP(D526,'Input Wonen'!$D$13:$H$151,2,FALSE)","v":"Wandtegelwerk badkamer, toilet en keuken"},{"$f":"VLOOKUP(D526,'Input Wonen'!$D$13:$H$151,3,FALSE)","v":"Keramische tegels; geglazuurd/gelijmd"},null,"BI04.HNN",{"$f":"IFERROR(VLOOKUP(H526,'Input Wonen'!$J$13:$N$151,COLUMNS('Input Wonen'!J:K),FALSE),\"\")","v":"Wandtegelwerk badkamer, toilet en keuken"},{"$f":"IFERROR(VLOOKUP(H526,'Input Wonen'!$J$13:$N$151,COLUMNS('Input Wonen'!J:L),FALSE),\"\")","v":"Mosa C2C wandtegels"},null,"BI04.E",{"$f":"IFERROR(VLOOKUP(L526,'Input Wonen'!$P$13:$T$151,COLUMNS('Input Wonen'!P:Q),FALSE),\"\")","v":"Wandtegelwerk badkamer, toilet en keuken"},{"$f":"IFERROR(VLOOKUP(L526,'Input Wonen'!$P$13:$T$151,COLUMNS('Input Wonen'!P:R),FALSE),\"\")","v":"Gerecycled PET i.c.m. Quartz"}]
[null,null,null,null,"Klimaatinstallaties",null,null,null,"Klimaatinstallaties",null,null,null,"Klimaatinstallaties"]
[null,null,null,"KL06.t",{"$f":"VLOOKUP(D528,'Input Wonen'!$D$13:$H$151,2,FALSE)","v":"Waterleidingen, verwarmd tapwater"},{"$f":"VLOOKUP(D528,'Input Wonen'!$D$13:$H$151,3,FALSE)","v":"PVC, incl. mantelbuis 15mm; W-bouw"},null,"KL06.HNN",{"$f":"IFERROR(VLOOKUP(H528,'Input Wonen'!$J$13:$N$151,COLUMNS('Input Wonen'!J:K),FALSE),\"\")","v":"Waterleidingen, verwarmd tapwater"},{"$f":"IFERROR(VLOOKUP(H528,'Input Wonen'!$J$13:$N$151,COLUMNS('Input Wonen'!J:L),FALSE),\"\")","v":"PVC, incl. mantelbuis 15mm; W-bouw"},null,"KL06.E",{"$f":"IFERROR(VLOOKUP(L528,'Input Wonen'!$P$13:$T$151,COLUMNS('Input Wonen'!P:Q),FALSE),\"\")","v":"Waterleidingen, verwarmd tapwater"},{"$f":"IFERROR(VLOOKUP(L528,'Input Wonen'!$P$13:$T$151,COLUMNS('Input Wonen'!P:R),FALSE),\"\")","v":"PVC, incl. mantelbuis 15mm; W-bouw"}]
[null,null,null,"KL07.t",{"$f":"VLOOKUP(D529,'Input Wonen'!$D$13:$H$151,2,FALSE)","v":"Warmtapwaterinstallatie"},{"$f":"VLOOKUP(D529,'Input Wonen'!$D$13:$H$151,3,FALSE)","v":"Elektrische boiler; CW:4-6 120 liter"},null,"KL07.HNN",{"$f":"IFERROR(VLOOKUP(H529,'Input Wonen'!$J$13:$N$151,COLUMNS('Input Wonen'!J:K),FALSE),\"\")","v":"Warmtapwaterinstallatie"},{"$f":"IFERROR(VLOOKUP(H529,'Input Wonen'!$J$13:$N$151,COLUMNS('Input Wonen'!J:L),FALSE),\"\")","v":"Elektrische boiler; CW:4-6 120 liter"},null,"KL07.E",{"$f":"IFERROR(VLOOKUP(L529,'Input Wonen'!$P$13:$T$151,COLUMNS('Input Wonen'!P:Q),FALSE),\"\")","v":"Warmtapwaterinstallatie"},{"$f":"IFERROR(VLOOKUP(L529,'Input Wonen'!$P$13:$T$151,COLUMNS('Input Wonen'!P:R),FALSE),\"\")","v":"Elektrische boiler; CW:4-6 120 liter"}]
[null,null,null,"KL03.t",{"$f":"VLOOKUP(D530,'Input Wonen'!$D$13:$H$151,2,FALSE)","v":"Warmteafgiftesysteem"},{"$f":"VLOOKUP(D530,'Input Wonen'!$D$13:$H$151,3,FALSE)","v":"Vloerverwarming 95 W/m2"},null,"KL03.HNN",{"$f":"IFERROR(VLOOKUP(H530,'Input Wonen'!$J$13:$N$151,COLUMNS('Input Wonen'!J:K),FALSE),\"\")","v":"Warmteafgiftesysteem"},{"$f":"IFERROR(VLOOKUP(H530,'Input Wonen'!$J$13:$N$151,COLUMNS('Input Wonen'!J:L),FALSE),\"\")","v":"Vloerverwarming 95 W/m2"},null,"KL03.E",{"$f":"IFERROR(VLOOKUP(L530,'Input Wonen'!$P$13:$T$151,COLUMNS('Input Wonen'!P:Q),FALSE),\"\")","v":"Warmteafgiftesysteem"},{"$f":"IFERROR(VLOOKUP(L530,'Input Wonen'!$P$13:$T$151,COLUMNS('Input Wonen'!P:R),FALSE),\"\")","v":"Vloerverwarming 95 W/m2 "}]
[null,null,null,"KL08.t",{"$f":"VLOOKUP(D531,'Input Wonen'!$D$13:$H$151,2,FALSE)","v":"Warmteopwekkinginstallatie"},{"$f":"VLOOKUP(D531,'Input Wonen'!$D$13:$H$151,3,FALSE)","v":"Warmtepomp luchtwater 10kW"},null,"KL08.HNN",{"$f":"IFERROR(VLOOKUP(H531,'Input Wonen'!$J$13:$N$151,COLUMNS('Input Wonen'!J:K),FALSE),\"\")","v":"Warmteopwekkinginstallatie"},{"$f":"IFERROR(VLOOKUP(H531,'Input Wonen'!$J$13:$N$151,COLUMNS('Input Wonen'!J:L),FALSE),\"\")","v":"Warmtepomp luchtwater 10kW"},null,"KL08.E",{"$f":"IFERROR(VLOOKUP(L531,'Input Wonen'!$P$13:$T$151,COLUMNS('Input Wonen'!P:Q),FALSE),\"\")","v":"Warmteopwekkinginstallatie"},{"$f":"IFERROR(VLOOKUP(L531,'Input Wonen'!$P$13:$T$151,COLUMNS('Input Wonen'!P:R),FALSE),\"\")","v":"Warmtepomp luchtwater 10kW"}]
[null,null,null,"KL02.t",{"$f":"VLOOKUP(D532,'Input Wonen'!$D$13:$H$151,2,FALSE)","v":"Warmtedistributiesysteem"},{"$f":"VLOOKUP(D532,'Input Wonen'!$D$13:$H$151,3,FALSE)","v":"CV-leidingen incl. koppelingen + verdeling"},null,"KL02.HNN",{"$f":"IFERROR(VLOOKUP(H532,'Input Wonen'!$J$13:$N$151,COLUMNS('Input Wonen'!J:K),FALSE),\"\")","v":"Warmtedistributiesysteem"},{"$f":"IFERROR(VLOOKUP(H532,'Input Wonen'!$J$13:$N$151,COLUMNS('Input Wonen'!J:L),FALSE),\"\")","v":"CV-leidingen incl. koppelingen + verdeling"},null,"KL02.E",{"$f":"IFERROR(VLOOKUP(L532,'Input Wonen'!$P$13:$T$151,COLUMNS('Input Wonen'!P:Q),FALSE),\"\")","v":"Warmtedistributiesysteem"},{"$f":"IFERROR(VLOOKUP(L532,'Input Wonen'!$P$13:$T$151,COLUMNS('Input Wonen'!P:R),FALSE),\"\")","v":"CV-leidingen incl. koppelingen + verdeling"}]
[null,null,null,"KL05.t",{"$f":"VLOOKUP(D533,'Input Wonen'!$D$13:$H$151,2,FALSE)","v":"Luchtdistributiesysteem"},{"$f":"VLOOKUP(D533,'Input Wonen'!$D$13:$H$151,3,FALSE)","v":"VLA ventilatiesysteem, type D met centrale wtw; W-bouw, individueel"},null,"KL05.HNN",{"$f":"IFERROR(VLOOKUP(H533,'Input Wonen'!$J$13:$N$151,COLUMNS('Input Wonen'!J:K),FALSE),\"\")","v":"Luchtdistributiesysteem"},{"$f":"IFERROR(VLOOKUP(H533,'Input Wonen'!$J$13:$N$151,COLUMNS('Input Wonen'!J:L),FALSE),\"\")","v":"VLA ventilatiesysteem, type D met centrale wtw; W-bouw, individueel"},null,"KL05.E",{"$f":"IFERROR(VLOOKUP(L533,'Input Wonen'!$P$13:$T$151,COLUMNS('Input Wonen'!P:Q),FALSE),\"\")","v":"Luchtdistributiesysteem"},{"$f":"IFERROR(VLOOKUP(L533,'Input Wonen'!$P$13:$T$151,COLUMNS('Input Wonen'!P:R),FALSE),\"\")","v":"VLA ventilatiesysteem, type D met centrale wtw; W-bouw, individueel"}]
[null,null,null,null,"Elektrische installaties",null,null,null,"Elektrische installaties",null,null,null,"Elektrische installaties"]
[null,null,null,"EL05.t",{"$f":"VLOOKUP(D535,'Input Wonen'!$D$13:$H$151,2,FALSE)","v":"Elektriciteitsleidingen"},{"$f":"VLOOKUP(D535,'Input Wonen'!$D$13:$H$151,3,FALSE)","v":"Koper met PP-isolatie"},null,"EL05.HNN",{"$f":"IFERROR(VLOOKUP(H535,'Input Wonen'!$J$13:$N$151,COLUMNS('Input Wonen'!J:K),FALSE),\"\")","v":"Elektriciteitsleidingen"},{"$f":"IFERROR(VLOOKUP(H535,'Input Wonen'!$J$13:$N$151,COLUMNS('Input Wonen'!J:L),FALSE),\"\")","v":"Koper met PP-isolatie"},null,"EL05.E",{"$f":"IFERROR(VLOOKUP(L535,'Input Wonen'!$P$13:$T$151,COLUMNS('Input Wonen'!P:Q),FALSE),\"\")","v":"Elektriciteitsleidingen"},{"$f":"IFERROR(VLOOKUP(L535,'Input Wonen'!$P$13:$T$151,COLUMNS('Input Wonen'!P:R),FALSE),\"\")","v":"Koper met PP-isolatie"}]
[null,null,null,"EL03.t",{"$f":"VLOOKUP(D536,'Input Wonen'!$D$13:$H$151,2,FALSE)","v":"Pv-panelen, plat dak"},{"$f":"VLOOKUP(D536,'Input Wonen'!$D$13:$H$151,3,FALSE)","v":"Mono-Si; incl. inverter+kabels"},null,"EL03.HNN",{"$f":"IFERROR(VLOOKUP(H536,'Input Wonen'!$J$13:$N$151,COLUMNS('Input Wonen'!J:K),FALSE),\"\")","v":"Pv-panelen, plat dak"},{"$f":"IFERROR(VLOOKUP(H536,'Input Wonen'!$J$13:$N$151,COLUMNS('Input Wonen'!J:L),FALSE),\"\")","v":"Exasun Xglass"},null,"EL03.E",{"$f":"IFERROR(VLOOKUP(L536,'Input Wonen'!$P$13:$T$151,COLUMNS('Input Wonen'!P:Q),FALSE),\"\")","v":"Pv-panelen, plat dak"},{"$f":"IFERROR(VLOOKUP(L536,'Input Wonen'!$P$13:$T$151,COLUMNS('Input Wonen'!P:R),FALSE),\"\")","v":"Exasun Xglass"}]
[null,null,null,"EL04.t",{"$f":"VLOOKUP(D537,'Input Wonen'!$D$13:$H$151,2,FALSE)","v":"Verlichting"},{"$f":"VLOOKUP(D537,'Input Wonen'!$D$13:$H$151,3,FALSE)","v":"LED-120cm"},null,"EL04.HNN",{"$f":"IFERROR(VLOOKUP(H537,'Input Wonen'!$J$13:$N$151,COLUMNS('Input Wonen'!J:K),FALSE),\"\")","v":"Verlichting"},{"$f":"IFERROR(VLOOKUP(H537,'Input Wonen'!$J$13:$N$151,COLUMNS('Input Wonen'!J:L),FALSE),\"\")","v":"LED-120cm"},null,"EL04.E",{"$f":"IFERROR(VLOOKUP(L537,'Input Wonen'!$P$13:$T$151,COLUMNS('Input Wonen'!P:Q),FALSE),\"\")","v":"Verlichting"},{"$f":"IFERROR(VLOOKUP(L537,'Input Wonen'!$P$13:$T$151,COLUMNS('Input Wonen'!P:R),FALSE),\"\")","v":"LED-120cm"}]
[null,null,null,null,"Toe- en afvoeren",null,null,null,"Toe- en afvoeren",null,null,null,"Toe- en afvoeren"]
[null,null,null,"TO01.t",{"$f":"VLOOKUP(D539,'Input Wonen'!$D$13:$H$151,2,FALSE)","v":"Waterleidingen"},{"$f":"VLOOKUP(D539,'Input Wonen'!$D$13:$H$151,3,FALSE)","v":"Polyetheen; leiding+mantelbuis"},null,"TO01.HNN",{"$f":"IFERROR(VLOOKUP(H539,'Input Wonen'!$J$13:$N$151,COLUMNS('Input Wonen'!J:K),FALSE),\"\")","v":"Waterleidingen"},{"$f":"IFERROR(VLOOKUP(H539,'Input Wonen'!$J$13:$N$151,COLUMNS('Input Wonen'!J:L),FALSE),\"\")","v":"Polyetheen"},null,"TO01.E",{"$f":"IFERROR(VLOOKUP(L539,'Input Wonen'!$P$13:$T$151,COLUMNS('Input Wonen'!P:Q),FALSE),\"\")","v":"Waterleidingen"},{"$f":"IFERROR(VLOOKUP(L539,'Input Wonen'!$P$13:$T$151,COLUMNS('Input Wonen'!P:R),FALSE),\"\")","v":"Polyetheen"}]
[null,null,null,"TO02.t",{"$f":"VLOOKUP(D540,'Input Wonen'!$D$13:$H$151,2,FALSE)","v":"Buitenriolering kavel"},{"$f":"VLOOKUP(D540,'Input Wonen'!$D$13:$H$151,3,FALSE)","v":"PVC"},null,"TO02.HNN",{"$f":"IFERROR(VLOOKUP(H540,'Input Wonen'!$J$13:$N$151,COLUMNS('Input Wonen'!J:K),FALSE),\"\")","v":"Buitenriolering"},{"$f":"IFERROR(VLOOKUP(H540,'Input Wonen'!$J$13:$N$151,COLUMNS('Input Wonen'!J:L),FALSE),\"\")","v":"Gerecycled PVC (Pipelife)"},null,"TO02.E",{"$f":"IFERROR(VLOOKUP(L540,'Input Wonen'!$P$13:$T$151,COLUMNS('Input Wonen'!P:Q),FALSE),\"\")","v":"Buitenriolering"},{"$f":"IFERROR(VLOOKUP(L540,'Input Wonen'!$P$13:$T$151,COLUMNS('Input Wonen'!P:R),FALSE),\"\")","v":"Gerecycled PVC (Pipelife)"}]
[null,null,null,"TO03.t",{"$f":"VLOOKUP(D541,'Input Wonen'!$D$13:$H$151,2,FALSE)","v":"Binnenriolering"},{"$f":"VLOOKUP(D541,'Input Wonen'!$D$13:$H$151,3,FALSE)","v":"PVC"},null,"TO03.HNN",{"$f":"IFERROR(VLOOKUP(H541,'Input Wonen'!$J$13:$N$151,COLUMNS('Input Wonen'!J:K),FALSE),\"\")","v":"Binnenriolering"},{"$f":"IFERROR(VLOOKUP(H541,'Input Wonen'!$J$13:$N$151,COLUMNS('Input Wonen'!J:L),FALSE),\"\")","v":"Gerecycled PVC (Pipelife)"},null,"TO03.E",{"$f":"IFERROR(VLOOKUP(L541,'Input Wonen'!$P$13:$T$151,COLUMNS('Input Wonen'!P:Q),FALSE),\"\")","v":"Binnenriolering"},{"$f":"IFERROR(VLOOKUP(L541,'Input Wonen'!$P$13:$T$151,COLUMNS('Input Wonen'!P:R),FALSE),\"\")","v":"Gerecycled PVC (Pipelife)"}]
[null,null,null,"TO04.t",{"$f":"VLOOKUP(D542,'Input Wonen'!$D$13:$H$151,2,FALSE)","v":"Hemelwaterafvoer"},{"$f":"VLOOKUP(D542,'Input Wonen'!$D$13:$H$151,3,FALSE)","v":"PVC"},null,"TO04.HNN",{"$f":"IFERROR(VLOOKUP(H542,'Input Wonen'!$J$13:$N$151,COLUMNS('Input Wonen'!J:K),FALSE),\"\")","v":"Hemelwaterafvoer"},{"$f":"IFERROR(VLOOKUP(H542,'Input Wonen'!$J$13:$N$151,COLUMNS('Input Wonen'!J:L),FALSE),\"\")","v":"Gerecycled PVC (Pipelife)"},null,"TO04.E",{"$f":"IFERROR(VLOOKUP(L542,'Input Wonen'!$P$13:$T$151,COLUMNS('Input Wonen'!P:Q),FALSE),\"\")","v":"Hemelwaterafvoer"},{"$f":"IFERROR(VLOOKUP(L542,'Input Wonen'!$P$13:$T$151,COLUMNS('Input Wonen'!P:R),FALSE),\"\")","v":"Gerecycled PVC (Pipelife)"}]
[null,null,null,null,"Verkeersruimte",null,null,null,"Verkeersruimte",null,null,null,"Verkeersruimte"]
[null,null,null,"VE02.t",{"$f":"VLOOKUP(D544,'Input Wonen'!$D$13:$H$151,2,FALSE)","v":"Centrale trap"},{"$f":"VLOOKUP(D544,'Input Wonen'!$D$13:$H$151,3,FALSE)","v":"Prefab beton"},null,"VE02.HNN",{"$f":"IFERROR(VLOOKUP(H544,'Input Wonen'!$J$13:$N$151,COLUMNS('Input Wonen'!J:K),FALSE),\"\")","v":"Centrale trap"},{"$f":"IFERROR(VLOOKUP(H544,'Input Wonen'!$J$13:$N$151,COLUMNS('Input Wonen'!J:L),FALSE),\"\")","v":"Prefab beton"},null,"VE02.E",{"$f":"IFERROR(VLOOKUP(L544,'Input Wonen'!$P$13:$T$151,COLUMNS('Input Wonen'!P:Q),FALSE),\"\")","v":"Centrale trap"},{"$f":"IFERROR(VLOOKUP(L544,'Input Wonen'!$P$13:$T$151,COLUMNS('Input Wonen'!P:R),FALSE),\"\")","v":"Prefab beton"}]
[null,null,null,"VE06.t",{"$f":"VLOOKUP(D545,'Input Wonen'!$D$13:$H$151,2,FALSE)","v":"Leuningen"},{"$f":"VLOOKUP(D545,'Input Wonen'!$D$13:$H$151,3,FALSE)","v":"Aluminium"},null,"VE06.HNN",{"$f":"IFERROR(VLOOKUP(H545,'Input Wonen'!$J$13:$N$151,COLUMNS('Input Wonen'!J:K),FALSE),\"\")","v":"Leuningen"},{"$f":"IFERROR(VLOOKUP(H545,'Input Wonen'!$J$13:$N$151,COLUMNS('Input Wonen'!J:L),FALSE),\"\")","v":"Aluminium"},null,"VE06.E",{"$f":"IFERROR(VLOOKUP(L545,'Input Wonen'!$P$13:$T$151,COLUMNS('Input Wonen'!P:Q),FALSE),\"\")","v":"Leuningen"},{"$f":"IFERROR(VLOOKUP(L545,'Input Wonen'!$P$13:$T$151,COLUMNS('Input Wonen'!P:R),FALSE),\"\")","v":"Aluminium"}]
[null,null,null,"VE09.t",{"$f":"VLOOKUP(D546,'Input Wonen'!$D$13:$H$151,2,FALSE)","v":"Balustrades"},{"$f":"VLOOKUP(D546,'Input Wonen'!$D$13:$H$151,3,FALSE)","v":"Staal; gepoedercoat; spijlen"},null,"VE09.HNN",{"$f":"IFERROR(VLOOKUP(H546,'Input Wonen'!$J$13:$N$151,COLUMNS('Input Wonen'!J:K),FALSE),\"\")","v":"Balustrades"},{"$f":"IFERROR(VLOOKUP(H546,'Input Wonen'!$J$13:$N$151,COLUMNS('Input Wonen'!J:L),FALSE),\"\")","v":"Staal; gepoedercoat; spijlen"},null,"VE09.E",{"$f":"IFERROR(VLOOKUP(L546,'Input Wonen'!$P$13:$T$151,COLUMNS('Input Wonen'!P:Q),FALSE),\"\")","v":"Balustrades"},{"$f":"IFERROR(VLOOKUP(L546,'Input Wonen'!$P$13:$T$151,COLUMNS('Input Wonen'!P:R),FALSE),\"\")","v":"Staal; gepoedercoat; spijlen"}]
[null,null,null,"VE08.t",{"$f":"VLOOKUP(D547,'Input Wonen'!$D$13:$H$151,2,FALSE)","v":"Liftinstallatie"},{"$f":"VLOOKUP(D547,'Input Wonen'!$D$13:$H$151,3,FALSE)","v":"Staal"},null,"VE08.HNN",{"$f":"IFERROR(VLOOKUP(H547,'Input Wonen'!$J$13:$N$151,COLUMNS('Input Wonen'!J:K),FALSE),\"\")","v":"Liftinstallatie"},{"$f":"IFERROR(VLOOKUP(H547,'Input Wonen'!$J$13:$N$151,COLUMNS('Input Wonen'!J:L),FALSE),\"\")","v":"Staal"},null,"VE08.E",{"$f":"IFERROR(VLOOKUP(L547,'Input Wonen'!$P$13:$T$151,COLUMNS('Input Wonen'!P:Q),FALSE),\"\")","v":"Liftinstallatie"},{"$f":"IFERROR(VLOOKUP(L547,'Input Wonen'!$P$13:$T$151,COLUMNS('Input Wonen'!P:R),FALSE),\"\")","v":"Staal"}]
[null,null,null,null,"Vaste voorzieningen",null,null,null,"Vaste voorzieningen",null,null,null,"Vaste voorzieningen"]
[null,null,null,"VA01.t",{"$f":"VLOOKUP(D549,'Input Wonen'!$D$13:$H$151,2,FALSE)","v":"Toiletten; wandcloset + fontein"},{"$f":"VLOOKUP(D549,'Input Wonen'!$D$13:$H$151,3,FALSE)","v":"Porselein"},null,"VA01.HNN",{"$f":"IFERROR(VLOOKUP(H549,'Input Wonen'!$J$13:$N$151,COLUMNS('Input Wonen'!J:K),FALSE),\"\")","v":"Toiletten; wandcloset + fontein"},{"$f":"IFERROR(VLOOKUP(H549,'Input Wonen'!$J$13:$N$151,COLUMNS('Input Wonen'!J:L),FALSE),\"\")","v":"Porselein"},null,"VA01.E",{"$f":"IFERROR(VLOOKUP(L549,'Input Wonen'!$P$13:$T$151,COLUMNS('Input Wonen'!P:Q),FALSE),\"\")","v":"Toiletten; wandcloset + fontein"},{"$f":"IFERROR(VLOOKUP(L549,'Input Wonen'!$P$13:$T$151,COLUMNS('Input Wonen'!P:R),FALSE),\"\")","v":"Porselein"}]
[null,null,null,"VA02.t",{"$f":"VLOOKUP(D550,'Input Wonen'!$D$13:$H$151,2,FALSE)","v":"Wastafel"},{"$f":"VLOOKUP(D550,'Input Wonen'!$D$13:$H$151,3,FALSE)","v":"Keramisch"},null,"VA02.HNN",{"$f":"IFERROR(VLOOKUP(H550,'Input Wonen'!$J$13:$N$151,COLUMNS('Input Wonen'!J:K),FALSE),\"\")","v":"Wastafel"},{"$f":"IFERROR(VLOOKUP(H550,'Input Wonen'!$J$13:$N$151,COLUMNS('Input Wonen'!J:L),FALSE),\"\")","v":"Keramisch"},null,"VA02.E",{"$f":"IFERROR(VLOOKUP(L550,'Input Wonen'!$P$13:$T$151,COLUMNS('Input Wonen'!P:Q),FALSE),\"\")","v":"Wastafel"},{"$f":"IFERROR(VLOOKUP(L550,'Input Wonen'!$P$13:$T$151,COLUMNS('Input Wonen'!P:R),FALSE),\"\")","v":"Keramisch"}]
[null,null,null,"VA03.t",{"$f":"VLOOKUP(D551,'Input Wonen'!$D$13:$H$151,2,FALSE)","v":"Inloopdouche"},{"$f":"VLOOKUP(D551,'Input Wonen'!$D$13:$H$151,3,FALSE)","v":"Gipsblokken + tegels incl. rvs afvoergoot"},null,"VA03.HNN",{"$f":"IFERROR(VLOOKUP(H551,'Input Wonen'!$J$13:$N$151,COLUMNS('Input Wonen'!J:K),FALSE),\"\")","v":"Inloopdouche"},{"$f":"IFERROR(VLOOKUP(H551,'Input Wonen'!$J$13:$N$151,COLUMNS('Input Wonen'!J:L),FALSE),\"\")","v":"Gipsblokken + tegels incl. rvs afvoergoot"},null,"VA03.E",{"$f":"IFERROR(VLOOKUP(L551,'Input Wonen'!$P$13:$T$151,COLUMNS('Input Wonen'!P:Q),FALSE),\"\")","v":"Inloopdouche"},{"$f":"IFERROR(VLOOKUP(L551,'Input Wonen'!$P$13:$T$151,COLUMNS('Input Wonen'!P:R),FALSE),\"\")","v":"Gipsblokken + tegels incl. rvs afvoergoot"}]
[null,null,null,null,"Overige kosten",null,null,null,"Overige kosten",null,null,null,"Overige kosten"]
[null,null,null,"OK01.t",{"$f":"VLOOKUP(D553,'Input Wonen'!$D$13:$H$165,2,FALSE)","v":"Grondwerk, maatvoering, invoeren en sparingen"},null,null,"OK01.HNN",{"$f":"VLOOKUP(H553,'Input Wonen'!$J$13:$N$165,2,FALSE)","v":"Grondwerk, maatvoering, invoeren en sparingen"},null,null,"OK01.E",{"$f":"VLOOKUP(H553,'Input Wonen'!$J$13:$N$165,2,FALSE)","v":"Grondwerk, maatvoering, invoeren en sparingen"}]
[null,null,null,"OK02.t",{"$f":"VLOOKUP(D554,'Input Wonen'!$D$13:$H$165,2,FALSE)","v":"Gevelsteiger"},null,null,"OK02.HNN",{"$f":"VLOOKUP(H554,'Input Wonen'!$J$13:$N$165,2,FALSE)","v":"Gevelsteiger"},null,null,"OK02.E",{"$f":"VLOOKUP(H554,'Input Wonen'!$J$13:$N$165,2,FALSE)","v":"Gevelsteiger"}]
[null,null,null,"OK03.t",{"$f":"VLOOKUP(D555,'Input Wonen'!$D$13:$H$165,2,FALSE)","v":"Dakvalbeveiliging en inplakken van doorvoeren"},null,null,"OK03.HNN",{"$f":"VLOOKUP(H555,'Input Wonen'!$J$13:$N$165,2,FALSE)","v":"Dakvalbeveiliging en inplakken van doorvoeren"},null,null,"OK03.E",{"$f":"VLOOKUP(H555,'Input Wonen'!$J$13:$N$165,2,FALSE)","v":"Dakvalbeveiliging en inplakken van doorvoeren"}]
[null,null,null,"OK04.t",{"$f":"VLOOKUP(D556,'Input Wonen'!$D$13:$H$165,2,FALSE)","v":"Afbouwwerkzaamheden (klein timmerwerk, schilderwerk)"},null,null,"OK04.HNN",{"$f":"VLOOKUP(H556,'Input Wonen'!$J$13:$N$165,2,FALSE)","v":"Afbouwwerkzaamheden (klein timmerwerk, schilderwerk)"},null,null,"OK04.E",{"$f":"VLOOKUP(H556,'Input Wonen'!$J$13:$N$165,2,FALSE)","v":"Afbouwwerkzaamheden (klein timmerwerk, schilderwerk)"}]
[null,null,null,"OK05.t",{"$f":"VLOOKUP(D557,'Input Wonen'!$D$13:$H$165,2,FALSE)","v":"Bouwkundige voorzieningen ten behoeve van installaties"},null,null,"OK05.HNN",{"$f":"VLOOKUP(H557,'Input Wonen'!$J$13:$N$165,2,FALSE)","v":"Bouwkundige voorzieningen ten behoeve van installaties"},null,null,"OK05.E",{"$f":"VLOOKUP(H557,'Input Wonen'!$J$13:$N$165,2,FALSE)","v":"Bouwkundige voorzieningen ten behoeve van installaties"}]
[null,null,null,"OK08b.t",{"$f":"VLOOKUP(D558,'Input Wonen'!$D$13:$H$165,2,FALSE)","v":"Installaties (E, W & klimaat) voor woontoren"},null,null,"OK08b.HNN",{"$f":"VLOOKUP(H558,'Input Wonen'!$J$13:$N$165,2,FALSE)","v":"Installaties (E, W & klimaat) voor woontoren"},null,null,"OK08b.E",{"$f":"VLOOKUP(H558,'Input Wonen'!$J$13:$N$165,2,FALSE)","v":"Installaties (E, W & klimaat) voor woontoren"}]
[null,null,null,"OK08c.t",{"$f":"VLOOKUP(D559,'Input Wonen'!$D$13:$H$165,2,FALSE)","v":"Installaties (onderhoud) voor woontoren"},null,null,"OK08c.HNN",{"$f":"VLOOKUP(H559,'Input Wonen'!$J$13:$N$165,2,FALSE)","v":"Installaties (onderhoud) voor woontoren"},null,null,"OK08c.E",{"$f":"VLOOKUP(H559,'Input Wonen'!$J$13:$N$165,2,FALSE)","v":"Installaties (onderhoud) voor woontoren"}]
[null,null,null,"OK12.t",{"$f":"VLOOKUP(D560,'Input Wonen'!$D$13:$H$172,2,FALSE)","v":"Toeslag directe kosten woontoren"},null,null,"OK12.HNN",{"$f":"VLOOKUP(H560,'Input Wonen'!$J$13:$N$172,2,FALSE)","v":"Toeslag directe kosten woontoren"},null,null,"OK12.E",{"$f":"VLOOKUP(H560,'Input Wonen'!$J$13:$N$172,2,FALSE)","v":"Toeslag directe kosten woontoren"}]
[null,null,null,null,"Traditioneel (RVO Referentieprojecten)",null,null,null,"Het Nieuwe Normaal",null,null,null,"Het Nieuwe Normaal ambitieus"]
[]
[null,null,null,null,"WONEN",null,null,null,"WONEN",null,null,null,"WONEN"]
[]
[]
[]
[]
[]
[]
[null,null,null,null,null,null,null,{"$f":"0.696-I570","v":0.61049999999999993},{"$f":"0.095-0.0095","v":8.5500000000000007E-2}]
[]
[]
[]
[]
[]
[]
[null,null,null,null,"Galerij",null,null,null,"Galerij",null,null,null,"Galerij"]
[null,null,null,null,"Element","Materialisatie",null,null,"Element","Materialisatie",null,null,"Element","Materialisatie"]
[]
[null,null,null,null,"Fundering",null,null,null,"Fundering",null,null,null,"Fundering"]
[null,null,null,"FU12.t",{"$f":"VLOOKUP(D581,'Input Wonen'!$D$13:$H$151,2,FALSE)","v":"Funderingspaal, ⌀ 350mm; l=15,0m"},{"$f":"VLOOKUP(D581,'Input Wonen'!$D$13:$H$151,3,FALSE)","v":"Schroefpaal; beton, in het werk gestort, C20/25,CEMIII; incl.wapening"},null,"FU12.HNN",{"$f":"IFERROR(VLOOKUP(H581,'Input Wonen'!$J$13:$N$151,COLUMNS('Input Wonen'!J:K),FALSE),\"\")","v":"Funderingspaal, ⌀ 350mm; l=15,0m"},{"$f":"IFERROR(VLOOKUP(H581,'Input Wonen'!$J$13:$N$151,COLUMNS('Input Wonen'!J:L),FALSE),\"\")","v":"Beton met 56% aan secundair aandeel (UMC)"},null,"FU12.E",{"$f":"IFERROR(VLOOKUP(L581,'Input Wonen'!$P$13:$T$151,COLUMNS('Input Wonen'!P:Q),FALSE),\"\")","v":"Funderingspaal, ⌀ 350mm; l=15,0m"},{"$f":"IFERROR(VLOOKUP(L581,'Input Wonen'!$P$13:$T$151,COLUMNS('Input Wonen'!P:R),FALSE),\"\")","v":"Beton met 56% aan secundair aandeel (UMC)"}]
[null,null,null,"FU09.t",{"$f":"VLOOKUP(D582,'Input Wonen'!$D$13:$H$151,2,FALSE)","v":"Funderingsbalken, 400x500mm"},{"$f":"VLOOKUP(D582,'Input Wonen'!$D$13:$H$151,3,FALSE)","v":"In het werk gestort"},null,"FU09.HNN",{"$f":"IFERROR(VLOOKUP(H582,'Input Wonen'!$J$13:$N$151,COLUMNS('Input Wonen'!J:K),FALSE),\"\")","v":"Funderingsbalken, 400x500mm"},{"$f":"IFERROR(VLOOKUP(H582,'Input Wonen'!$J$13:$N$151,COLUMNS('Input Wonen'!J:L),FALSE),\"\")","v":"Beton met 56% aan secundair aandeel (UMC)"},null,"FU09.E",{"$f":"IFERROR(VLOOKUP(L582,'Input Wonen'!$P$13:$T$151,COLUMNS('Input Wonen'!P:Q),FALSE),\"\")","v":"Funderingsbalken, 400x500mm"},{"$f":"IFERROR(VLOOKUP(L582,'Input Wonen'!$P$13:$T$151,COLUMNS('Input Wonen'!P:R),FALSE),\"\")","v":"Beton met 56% aan secundair aandeel (UMC)"}]
[null,null,null,"FU07.t",{"$f":"VLOOKUP(D583,'Input Wonen'!$D$13:$H$151,2,FALSE)","v":"Opgaand metselwerk"},{"$f":"VLOOKUP(D583,'Input Wonen'!$D$13:$H$151,3,FALSE)","v":"Kalkzandsteen lijmblokken, 100mm"},null,"FU07.HNN",{"$f":"IFERROR(VLOOKUP(H583,'Input Wonen'!$J$13:$N$151,COLUMNS('Input Wonen'!J:K),FALSE),\"\")","v":"Opgaand metselwerk"},{"$f":"IFERROR(VLOOKUP(H583,'Input Wonen'!$J$13:$N$151,COLUMNS('Input Wonen'!J:L),FALSE),\"\")","v":"Kalkzandsteen lijmblokken, 100mm"},null,"FU07.E",{"$f":"IFERROR(VLOOKUP(L583,'Input Wonen'!$P$13:$T$151,COLUMNS('Input Wonen'!P:Q),FALSE),\"\")","v":"Opgaand metselwerk"},{"$f":"IFERROR(VLOOKUP(L583,'Input Wonen'!$P$13:$T$151,COLUMNS('Input Wonen'!P:R),FALSE),\"\")","v":"Kalkzandsteen lijmblokken, 100mm"}]
[null,null,null,"FU05.t",{"$f":"VLOOKUP(D584,'Input Wonen'!$D$13:$H$151,2,FALSE)","v":"Bodemafsluiting, zand"},{"$f":"VLOOKUP(D584,'Input Wonen'!$D$13:$H$151,3,FALSE)","v":"Zand"},null,"FU05.HNN",{"$f":"IFERROR(VLOOKUP(H584,'Input Wonen'!$J$13:$N$151,COLUMNS('Input Wonen'!J:K),FALSE),\"\")","v":"Bodemafsluiting, 100 zand"},{"$f":"IFERROR(VLOOKUP(H584,'Input Wonen'!$J$13:$N$151,COLUMNS('Input Wonen'!J:L),FALSE),\"\")","v":"Zand"},null,"FU05.E",{"$f":"IFERROR(VLOOKUP(L584,'Input Wonen'!$P$13:$T$151,COLUMNS('Input Wonen'!P:Q),FALSE),\"\")","v":"Bodemafsluiting, 100 zand"},{"$f":"IFERROR(VLOOKUP(L584,'Input Wonen'!$P$13:$T$151,COLUMNS('Input Wonen'!P:R),FALSE),\"\")","v":"Zand"}]
[null,null,null,null,"Vloeren",null,null,null,"Vloeren",null,null,null,"Vloeren"]
[null,null,null,"VL11.t",{"$f":"VLOOKUP(D586,'Input Wonen'!$D$13:$H$151,2,FALSE)","v":"BG: kanaalplaatvloer, 200mm incl. isolatie (Rc=3,7)"},{"$f":"VLOOKUP(D586,'Input Wonen'!$D$13:$H$151,3,FALSE)","v":"Kanaalplaatvloer; prefab beton"},null,"VL11.HNN",{"$f":"IFERROR(VLOOKUP(H586,'Input Wonen'!$J$13:$N$151,COLUMNS('Input Wonen'!J:K),FALSE),\"\")","v":"BG: kanaalplaatvloer, 200mm incl. isolatie (Rc=3,7)"},{"$f":"IFERROR(VLOOKUP(H586,'Input Wonen'!$J$13:$N$151,COLUMNS('Input Wonen'!J:L),FALSE),\"\")","v":"Kanaalplaat, remontabel (28% recyclaat)"},null,"VL11.E",{"$f":"IFERROR(VLOOKUP(L586,'Input Wonen'!$P$13:$T$151,COLUMNS('Input Wonen'!P:Q),FALSE),\"\")","v":"BG: kanaalplaatvloer, 200mm incl. isolatie (Rc=3,7)"},{"$f":"IFERROR(VLOOKUP(L586,'Input Wonen'!$P$13:$T$151,COLUMNS('Input Wonen'!P:R),FALSE),\"\")","v":"Kanaalplaat, remontabel (28% recyclaat)"}]
[null,null,null,"VL07.t",{"$f":"VLOOKUP(D587,'Input Wonen'!$D$13:$H$151,2,FALSE)","v":"Dekvloeren, 60mm"},{"$f":"VLOOKUP(D587,'Input Wonen'!$D$13:$H$151,3,FALSE)","v":"Zandcement dekvloer"},null,"VL07.HNN",{"$f":"IFERROR(VLOOKUP(H587,'Input Wonen'!$J$13:$N$151,COLUMNS('Input Wonen'!J:K),FALSE),\"\")","v":"Dekvloeren, 60mm"},{"$f":"IFERROR(VLOOKUP(H587,'Input Wonen'!$J$13:$N$151,COLUMNS('Input Wonen'!J:L),FALSE),\"\")","v":"Fermacell honingraatvloer (op houten vloer)"},null,"VL07.E",{"$f":"IFERROR(VLOOKUP(L587,'Input Wonen'!$P$13:$T$151,COLUMNS('Input Wonen'!P:Q),FALSE),\"\")","v":"Dekvloeren, 60mm"},{"$f":"IFERROR(VLOOKUP(L587,'Input Wonen'!$P$13:$T$151,COLUMNS('Input Wonen'!P:R),FALSE),\"\")","v":"Fermacell honingraatvloer (op houten vloer)"}]
[null,null,null,"VL05.t",{"$f":"VLOOKUP(D588,'Input Wonen'!$D$13:$H$151,2,FALSE)","v":"VV: breedplaatvloer, 270mm incl. druklaag"},{"$f":"VLOOKUP(D588,'Input Wonen'!$D$13:$H$151,3,FALSE)","v":"Breedplaatvloer; incl. druklaag "},null,"VL05.HNN",{"$f":"IFERROR(VLOOKUP(H588,'Input Wonen'!$J$13:$N$151,COLUMNS('Input Wonen'!J:K),FALSE),\"\")","v":"VV: breedplaatvloer, 270mm incl. druklaag"},{"$f":"IFERROR(VLOOKUP(H588,'Input Wonen'!$J$13:$N$151,COLUMNS('Input Wonen'!J:L),FALSE),\"\")","v":"Breedplaatvloer; incl. druklaag (UMC)"},null,"VL05.E",{"$f":"IFERROR(VLOOKUP(L588,'Input Wonen'!$P$13:$T$151,COLUMNS('Input Wonen'!P:Q),FALSE),\"\")","v":"VV: CLT incl. dekvloer"},{"$f":"IFERROR(VLOOKUP(L588,'Input Wonen'!$P$13:$T$151,COLUMNS('Input Wonen'!P:R),FALSE),\"\")","v":"CLT verdiepingsvloer "}]
[null,null,null,"VL07.t",{"$f":"VLOOKUP(D589,'Input Wonen'!$D$13:$H$151,2,FALSE)","v":"Dekvloeren, 60mm"},{"$f":"VLOOKUP(D589,'Input Wonen'!$D$13:$H$151,3,FALSE)","v":"Zandcement dekvloer"},null,"VL07.HNN",{"$f":"IFERROR(VLOOKUP(H589,'Input Wonen'!$J$13:$N$151,COLUMNS('Input Wonen'!J:K),FALSE),\"\")","v":"Dekvloeren, 60mm"},{"$f":"IFERROR(VLOOKUP(H589,'Input Wonen'!$J$13:$N$151,COLUMNS('Input Wonen'!J:L),FALSE),\"\")","v":"Fermacell honingraatvloer (op houten vloer)"},null,"VL07.E",{"$f":"IFERROR(VLOOKUP(L589,'Input Wonen'!$P$13:$T$151,COLUMNS('Input Wonen'!P:Q),FALSE),\"\")","v":"Dekvloeren, 60mm"},{"$f":"IFERROR(VLOOKUP(L589,'Input Wonen'!$P$13:$T$151,COLUMNS('Input Wonen'!P:R),FALSE),\"\")","v":"Fermacell honingraatvloer (op houten vloer)"}]
[null,null,null,"VL03.t",{"$f":"VLOOKUP(D590,'Input Wonen'!$D$13:$H$151,2,FALSE)","v":"Vloertegelwerk toilet"},{"$f":"VLOOKUP(D590,'Input Wonen'!$D$13:$H$151,3,FALSE)","v":"Keramische tegels, geglazuurd/gelijmd"},null,"VL03.HNN",{"$f":"IFERROR(VLOOKUP(H590,'Input Wonen'!$J$13:$N$151,COLUMNS('Input Wonen'!J:K),FALSE),\"\")","v":"Vloertegelwerk toilet"},{"$f":"IFERROR(VLOOKUP(H590,'Input Wonen'!$J$13:$N$151,COLUMNS('Input Wonen'!J:L),FALSE),\"\")","v":"Mosa C2C vloertegels"},null,"VL03.E",{"$f":"IFERROR(VLOOKUP(L590,'Input Wonen'!$P$13:$T$151,COLUMNS('Input Wonen'!P:Q),FALSE),\"\")","v":"Vloertegelwerk toilet"},{"$f":"IFERROR(VLOOKUP(L590,'Input Wonen'!$P$13:$T$151,COLUMNS('Input Wonen'!P:R),FALSE),\"\")","v":"Mosa C2C vloertegels (losmaakbaar)"}]
[null,null,null,"VL04.t",{"$f":"VLOOKUP(D591,'Input Wonen'!$D$13:$H$151,2,FALSE)","v":"Vloertegelwerk badkamer"},{"$f":"VLOOKUP(D591,'Input Wonen'!$D$13:$H$151,3,FALSE)","v":"Keramische tegels, geglazuurd/gelijmd"},null,"VL04.HNN",{"$f":"IFERROR(VLOOKUP(H591,'Input Wonen'!$J$13:$N$151,COLUMNS('Input Wonen'!J:K),FALSE),\"\")","v":"Vloertegelwerk badkamer"},{"$f":"IFERROR(VLOOKUP(H591,'Input Wonen'!$J$13:$N$151,COLUMNS('Input Wonen'!J:L),FALSE),\"\")","v":"Mosa C2C vloertegels"},null,"VL04.E",{"$f":"IFERROR(VLOOKUP(L591,'Input Wonen'!$P$13:$T$151,COLUMNS('Input Wonen'!P:Q),FALSE),\"\")","v":"Vloertegelwerk badkamer"},{"$f":"IFERROR(VLOOKUP(L591,'Input Wonen'!$P$13:$T$151,COLUMNS('Input Wonen'!P:R),FALSE),\"\")","v":"Mosa C2C vloertegels (losmaakbaar)"}]
[null,null,null,"VL24.t",{"$f":"VLOOKUP(D592,'Input Wonen'!$D$13:$H$151,2,FALSE)","v":"Balustrades"},{"$f":"VLOOKUP(D592,'Input Wonen'!$D$13:$H$151,3,FALSE)","v":"Staal; gepoedercoat; spijlen"},null,"VL24.HNN",{"$f":"IFERROR(VLOOKUP(H592,'Input Wonen'!$J$13:$N$151,COLUMNS('Input Wonen'!J:K),FALSE),\"\")","v":"Balustrades"},{"$f":"IFERROR(VLOOKUP(H592,'Input Wonen'!$J$13:$N$151,COLUMNS('Input Wonen'!J:L),FALSE),\"\")","v":"Staal; gepoedercoat; spijlen"},null,"VL24.E",{"$f":"IFERROR(VLOOKUP(L592,'Input Wonen'!$P$13:$T$151,COLUMNS('Input Wonen'!P:Q),FALSE),\"\")","v":"Balustrades"},{"$f":"IFERROR(VLOOKUP(L592,'Input Wonen'!$P$13:$T$151,COLUMNS('Input Wonen'!P:R),FALSE),\"\")","v":"Staal; gepoedercoat; spijlen"}]
[null,null,null,"VL09.t",{"$f":"VLOOKUP(D593,'Input Wonen'!$D$13:$H$151,2,FALSE)","v":"Balkon- en galerijvloeren"},{"$f":"VLOOKUP(D593,'Input Wonen'!$D$13:$H$151,3,FALSE)","v":"Prefab beton, 250mm"},null,"VL09.HNN",{"$f":"IFERROR(VLOOKUP(H593,'Input Wonen'!$J$13:$N$151,COLUMNS('Input Wonen'!J:K),FALSE),\"\")","v":"Balkon- en galerijvloeren"},{"$f":"IFERROR(VLOOKUP(H593,'Input Wonen'!$J$13:$N$151,COLUMNS('Input Wonen'!J:L),FALSE),\"\")","v":"Prefab beton, 250mm"},null,"VL09.E",{"$f":"IFERROR(VLOOKUP(L593,'Input Wonen'!$P$13:$T$151,COLUMNS('Input Wonen'!P:Q),FALSE),\"\")","v":"Balkon- en galerijvloeren"},{"$f":"IFERROR(VLOOKUP(L593,'Input Wonen'!$P$13:$T$151,COLUMNS('Input Wonen'!P:R),FALSE),\"\")","v":"HSB element houten vloer + stalen ophanging (56,8 kg/m2 zie detail berekening excel)"}]
[null,null,null,null,"Draagconstructie",null,null,null,"Draagconstructie",null,null,null,"Draagconstructie"]
[null,null,null,"DR01.t",{"$f":"VLOOKUP(D595,'Input Wonen'!$D$13:$H$151,2,FALSE)","v":"Betonmortel"},{"$f":"VLOOKUP(D595,'Input Wonen'!$D$13:$H$151,3,FALSE)","v":"C20/C25,XC1,S3; 0% betongranulaat"},null,"DR01.HNN",{"$f":"IFERROR(VLOOKUP(H595,'Input Wonen'!$J$13:$N$151,COLUMNS('Input Wonen'!J:K),FALSE),\"\")","v":"Betonmortel"},{"$f":"IFERROR(VLOOKUP(H595,'Input Wonen'!$J$13:$N$151,COLUMNS('Input Wonen'!J:L),FALSE),\"\")","v":"C20/C25,XC1,S3; 20% betongranulaat"},null,"DR01.E",{"$f":"IFERROR(VLOOKUP(L595,'Input Wonen'!$P$13:$T$151,COLUMNS('Input Wonen'!P:Q),FALSE),\"\")","v":"Betonmortel"},{"$f":"IFERROR(VLOOKUP(L595,'Input Wonen'!$P$13:$T$151,COLUMNS('Input Wonen'!P:R),FALSE),\"\")","v":"C20/C25,XC1,S3; 56% betongranulaat"}]
[null,null,null,"DR02.t",{"$f":"VLOOKUP(D596,'Input Wonen'!$D$13:$H$151,2,FALSE)","v":"Wapeningsstaal"},{"$f":"VLOOKUP(D596,'Input Wonen'!$D$13:$H$151,3,FALSE)","v":"Staal"},null,"DR02.HNN",{"$f":"IFERROR(VLOOKUP(H596,'Input Wonen'!$J$13:$N$151,COLUMNS('Input Wonen'!J:K),FALSE),\"\")","v":"Wapeningsstaal"},{"$f":"IFERROR(VLOOKUP(H596,'Input Wonen'!$J$13:$N$151,COLUMNS('Input Wonen'!J:L),FALSE),\"\")","v":"Staal"},null,"DR02.E",{"$f":"IFERROR(VLOOKUP(L596,'Input Wonen'!$P$13:$T$151,COLUMNS('Input Wonen'!P:Q),FALSE),\"\")","v":"Wapeningsstaal"},{"$f":"IFERROR(VLOOKUP(L596,'Input Wonen'!$P$13:$T$151,COLUMNS('Input Wonen'!P:R),FALSE),\"\")","v":"Staal"}]
[null,null,null,"DR03.t",{"$f":"VLOOKUP(D597,'Input Wonen'!$D$13:$H$151,2,FALSE)","v":"Zwaar constructiestaal"},{"$f":"VLOOKUP(D597,'Input Wonen'!$D$13:$H$151,3,FALSE)","v":"7.820 kg/m3, incl. conservering"},null,"DR03.HNN",{"$f":"IFERROR(VLOOKUP(H597,'Input Wonen'!$J$13:$N$151,COLUMNS('Input Wonen'!J:K),FALSE),\"\")","v":"Zwaar constructiestaal"},{"$f":"IFERROR(VLOOKUP(H597,'Input Wonen'!$J$13:$N$151,COLUMNS('Input Wonen'!J:L),FALSE),\"\")","v":"7.820 kg/m3, incl. conservering"},null,"DR03.E",{"$f":"IFERROR(VLOOKUP(L597,'Input Wonen'!$P$13:$T$151,COLUMNS('Input Wonen'!P:Q),FALSE),\"\")","v":"Zwaar constructiestaal"},{"$f":"IFERROR(VLOOKUP(L597,'Input Wonen'!$P$13:$T$151,COLUMNS('Input Wonen'!P:R),FALSE),\"\")","v":"7.820 kg/m3, incl. conservering"}]
[null,null,null,null,"Gevel",null,null,null,"Gevel",null,null,null,"Gevel"]
[null,null,null,"GE29.t",{"$f":"VLOOKUP(D599,'Input Wonen'!$D$13:$H$151,2,FALSE)","v":"Gevelkozijnen; incl. HR++ beglazing"},{"$f":"VLOOKUP(D599,'Input Wonen'!$D$13:$H$151,3,FALSE)","v":"Aluminium"},null,"GE29.HNN",{"$f":"IFERROR(VLOOKUP(H599,'Input Wonen'!$J$13:$N$151,COLUMNS('Input Wonen'!J:K),FALSE),\"\")","v":"Gevelkozijnen; incl. HR++ beglazing"},{"$f":"IFERROR(VLOOKUP(H599,'Input Wonen'!$J$13:$N$151,COLUMNS('Input Wonen'!J:L),FALSE),\"\")","v":"Aluminium; 75% recyclaat (Hydro CIRCAL 75R)"},null,"GE29.E",{"$f":"IFERROR(VLOOKUP(L599,'Input Wonen'!$P$13:$T$151,COLUMNS('Input Wonen'!P:Q),FALSE),\"\")","v":"Gevelkozijnen; incl. Isomax beglazing"},{"$f":"IFERROR(VLOOKUP(L599,'Input Wonen'!$P$13:$T$151,COLUMNS('Input Wonen'!P:R),FALSE),\"\")","v":"Aluminium; 75% recyclaat (Hydro CIRCAL 75R)"}]
[null,null,null,"GE04.t",{"$f":"VLOOKUP(D600,'Input Wonen'!$D$13:$H$151,2,FALSE)","v":"Vensterbanken"},{"$f":"VLOOKUP(D600,'Input Wonen'!$D$13:$H$151,3,FALSE)","v":"Composietsteen "},null,"GE04.HNN",{"$f":"IFERROR(VLOOKUP(H600,'Input Wonen'!$J$13:$N$151,COLUMNS('Input Wonen'!J:K),FALSE),\"\")","v":"Vensterbanken"},{"$f":"IFERROR(VLOOKUP(H600,'Input Wonen'!$J$13:$N$151,COLUMNS('Input Wonen'!J:L),FALSE),\"\")","v":"Composietsteen"},null,"GE04.E",{"$f":"IFERROR(VLOOKUP(L600,'Input Wonen'!$P$13:$T$151,COLUMNS('Input Wonen'!P:Q),FALSE),\"\")","v":"Vensterbanken"},{"$f":"IFERROR(VLOOKUP(L600,'Input Wonen'!$P$13:$T$151,COLUMNS('Input Wonen'!P:R),FALSE),\"\")","v":"Composietsteen"}]
[null,null,null,"GE22.t",{"$f":"VLOOKUP(D601,'Input Wonen'!$D$13:$H$151,2,FALSE)","v":"Lateien"},{"$f":"VLOOKUP(D601,'Input Wonen'!$D$13:$H$151,3,FALSE)","v":"Prefab beton"},null,"GE22.HNN",{"$f":"IFERROR(VLOOKUP(H601,'Input Wonen'!$J$13:$N$151,COLUMNS('Input Wonen'!J:K),FALSE),\"\")","v":"Lateien"},{"$f":"IFERROR(VLOOKUP(H601,'Input Wonen'!$J$13:$N$151,COLUMNS('Input Wonen'!J:L),FALSE),\"\")","v":"Prefab beton"},null,"GE22.E",{"$f":"IFERROR(VLOOKUP(L601,'Input Wonen'!$P$13:$T$151,COLUMNS('Input Wonen'!P:Q),FALSE),\"\")","v":"Lateien"},{"$f":"IFERROR(VLOOKUP(L601,'Input Wonen'!$P$13:$T$151,COLUMNS('Input Wonen'!P:R),FALSE),\"\")","v":"Prefab beton"}]
[null,null,null,"GE32.t",{"$f":"VLOOKUP(D602,'Input Wonen'!$D$13:$H$151,2,FALSE)","v":"Waterslagen"},{"$f":"VLOOKUP(D602,'Input Wonen'!$D$13:$H$151,3,FALSE)","v":"Aluminium; gemoffeld"},null,"GE32.HNN",{"$f":"IFERROR(VLOOKUP(H602,'Input Wonen'!$J$13:$N$151,COLUMNS('Input Wonen'!J:K),FALSE),\"\")","v":"Waterslagen"},{"$f":"IFERROR(VLOOKUP(H602,'Input Wonen'!$J$13:$N$151,COLUMNS('Input Wonen'!J:L),FALSE),\"\")","v":"Aluminium; gemoffeld"},null,"GE32.E",{"$f":"IFERROR(VLOOKUP(L602,'Input Wonen'!$P$13:$T$151,COLUMNS('Input Wonen'!P:Q),FALSE),\"\")","v":"Waterslagen"},{"$f":"IFERROR(VLOOKUP(L602,'Input Wonen'!$P$13:$T$151,COLUMNS('Input Wonen'!P:R),FALSE),\"\")","v":"Aluminium; gemoffeld"}]
[null,null,null,"GE33.t",{"$f":"VLOOKUP(D603,'Input Wonen'!$D$13:$H$151,2,FALSE)","v":"Waterslagen"},{"$f":"VLOOKUP(D603,'Input Wonen'!$D$13:$H$151,3,FALSE)","v":"Composietsteen; gegoten"},null,"GE33.HNN",{"$f":"IFERROR(VLOOKUP(H603,'Input Wonen'!$J$13:$N$151,COLUMNS('Input Wonen'!J:K),FALSE),\"\")","v":"Waterslagen"},{"$f":"IFERROR(VLOOKUP(H603,'Input Wonen'!$J$13:$N$151,COLUMNS('Input Wonen'!J:L),FALSE),\"\")","v":"Composietsteen; gegoten"},null,"GE33.E",{"$f":"IFERROR(VLOOKUP(L603,'Input Wonen'!$P$13:$T$151,COLUMNS('Input Wonen'!P:Q),FALSE),\"\")","v":"Waterslagen"},{"$f":"IFERROR(VLOOKUP(L603,'Input Wonen'!$P$13:$T$151,COLUMNS('Input Wonen'!P:R),FALSE),\"\")","v":"Composietsteen; gegoten"}]
[null,null,null,"GE34.t",{"$f":"VLOOKUP(D604,'Input Wonen'!$D$13:$H$151,2,FALSE)","v":"Buitendeur; multiplex"},{"$f":"VLOOKUP(D604,'Input Wonen'!$D$13:$H$151,3,FALSE)","v":"Sandwich; 2x multiplex"},null,"GE34.HNN",{"$f":"IFERROR(VLOOKUP(H604,'Input Wonen'!$J$13:$N$151,COLUMNS('Input Wonen'!J:K),FALSE),\"\")","v":"Buitendeur; multiplex"},{"$f":"IFERROR(VLOOKUP(H604,'Input Wonen'!$J$13:$N$151,COLUMNS('Input Wonen'!J:L),FALSE),\"\")","v":"Sandwich; 2x multiplex"},null,"GE34.E",{"$f":"IFERROR(VLOOKUP(L604,'Input Wonen'!$P$13:$T$151,COLUMNS('Input Wonen'!P:Q),FALSE),\"\")","v":"Buitendeur; multiplex"},{"$f":"IFERROR(VLOOKUP(L604,'Input Wonen'!$P$13:$T$151,COLUMNS('Input Wonen'!P:R),FALSE),\"\")","v":"Sandwich; 2x multiplex"}]
[null,null,null,"GE36.t",{"$f":"VLOOKUP(D605,'Input Wonen'!$D$13:$H$151,2,FALSE)","v":"Buitendeur; aluminium"},{"$f":"VLOOKUP(D605,'Input Wonen'!$D$13:$H$151,3,FALSE)","v":"Aluminium, gemoffeld; bekleding volkern"},null,"GE36.HNN",{"$f":"IFERROR(VLOOKUP(H605,'Input Wonen'!$J$13:$N$151,COLUMNS('Input Wonen'!J:K),FALSE),\"\")","v":"Buitendeur; aluminium"},{"$f":"IFERROR(VLOOKUP(H605,'Input Wonen'!$J$13:$N$151,COLUMNS('Input Wonen'!J:L),FALSE),\"\")","v":"Aluminium, gemoffeld; bekleding volkern"},null,"GE36.E",{"$f":"IFERROR(VLOOKUP(L605,'Input Wonen'!$P$13:$T$151,COLUMNS('Input Wonen'!P:Q),FALSE),\"\")","v":"Buitendeur; aluminium"},{"$f":"IFERROR(VLOOKUP(L605,'Input Wonen'!$P$13:$T$151,COLUMNS('Input Wonen'!P:R),FALSE),\"\")","v":"Aluminium, gemoffeld; bekleding volkern"}]
[null,null,null,"GE24.t",{"$f":"VLOOKUP(D606,'Input Wonen'!$D$13:$H$151,2,FALSE)","v":"Binnenspouwblad, 250mm (bruto)"},{"$f":"VLOOKUP(D606,'Input Wonen'!$D$13:$H$151,3,FALSE)","v":"I.h.w.g. beton"},null,"GE24.HNN",{"$f":"IFERROR(VLOOKUP(H606,'Input Wonen'!$J$13:$N$151,COLUMNS('Input Wonen'!J:K),FALSE),\"\")","v":"Binnenspouwblad, 250mm (bruto)"},{"$f":"IFERROR(VLOOKUP(H606,'Input Wonen'!$J$13:$N$151,COLUMNS('Input Wonen'!J:L),FALSE),\"\")","v":"I.h.w.g. beton (UMC)"},null,"GE24.E",{"$f":"IFERROR(VLOOKUP(L606,'Input Wonen'!$P$13:$T$151,COLUMNS('Input Wonen'!P:Q),FALSE),\"\")","v":"Binnenspouwblad, CLT"},{"$f":"IFERROR(VLOOKUP(L606,'Input Wonen'!$P$13:$T$151,COLUMNS('Input Wonen'!P:R),FALSE),\"\")","v":"CLT wanden"}]
[null,null,null,"GE25.t",{"$f":"VLOOKUP(D607,'Input Wonen'!$D$13:$H$151,2,FALSE)","v":"Binnenspouwblad; niet dragend, 250mm (bruto)"},{"$f":"VLOOKUP(D607,'Input Wonen'!$D$13:$H$151,3,FALSE)","v":"HSB element incl. isolatie en beplating"},null,"GE25.HNN",{"$f":"IFERROR(VLOOKUP(H607,'Input Wonen'!$J$13:$N$151,COLUMNS('Input Wonen'!J:K),FALSE),\"\")","v":"Binnenspouwblad; niet dragend, 250mm (bruto)"},{"$f":"IFERROR(VLOOKUP(H607,'Input Wonen'!$J$13:$N$151,COLUMNS('Input Wonen'!J:L),FALSE),\"\")","v":"HSB element incl. isolatie en beplating"},null,"GE25.E",{"$f":"IFERROR(VLOOKUP(L607,'Input Wonen'!$P$13:$T$151,COLUMNS('Input Wonen'!P:Q),FALSE),\"\")","v":"Binnenspouwblad; niet dragend HSB (bruto)"},{"$f":"IFERROR(VLOOKUP(L607,'Input Wonen'!$P$13:$T$151,COLUMNS('Input Wonen'!P:R),FALSE),\"\")","v":"HSB element incl. Isovlas isolatie"}]
[null,null,null,"GE09.t",{"$f":"VLOOKUP(D608,'Input Wonen'!$D$13:$H$151,2,FALSE)","v":"Buitenspouwblad, 100mm"},{"$f":"VLOOKUP(D608,'Input Wonen'!$D$13:$H$151,3,FALSE)","v":"Baksteenmetselwerk"},null,"GE09.HNN",{"$f":"IFERROR(VLOOKUP(H608,'Input Wonen'!$J$13:$N$151,COLUMNS('Input Wonen'!J:K),FALSE),\"\")","v":"Buitenspouwblad"},{"$f":"IFERROR(VLOOKUP(H608,'Input Wonen'!$J$13:$N$151,COLUMNS('Input Wonen'!J:L),FALSE),\"\")","v":"Ecobrick Wienerberger"},null,"GE09.E",{"$f":"IFERROR(VLOOKUP(L608,'Input Wonen'!$P$13:$T$151,COLUMNS('Input Wonen'!P:Q),FALSE),\"\")","v":"Buitenspouwblad"},{"$f":"IFERROR(VLOOKUP(L608,'Input Wonen'!$P$13:$T$151,COLUMNS('Input Wonen'!P:R),FALSE),\"\")","v":"Houten gevelbekleding; Meranti delen"}]
[null,null,null,"GE70.t",{"$f":"VLOOKUP(D609,'Input Wonen'!$D$13:$H$151,2,FALSE)","v":"Isolatielagen, Rc=4,7"},{"$f":"VLOOKUP(D609,'Input Wonen'!$D$13:$H$151,3,FALSE)","v":"Isover Mupan Ultra XS"},null,"GE70.HNN",{"$f":"IFERROR(VLOOKUP(H609,'Input Wonen'!$J$13:$N$151,COLUMNS('Input Wonen'!J:K),FALSE),\"\")","v":"Isolatielagen, Rc=4,7"},{"$f":"IFERROR(VLOOKUP(H609,'Input Wonen'!$J$13:$N$151,COLUMNS('Input Wonen'!J:L),FALSE),\"\")","v":"Isover Mupan Ultra XS"},null,"GE70.E",{"$f":"IFERROR(VLOOKUP(L609,'Input Wonen'!$P$13:$T$151,COLUMNS('Input Wonen'!P:Q),FALSE),\"\")","v":"Isolatielagen, Rc=4,7"},{"$f":"IFERROR(VLOOKUP(L609,'Input Wonen'!$P$13:$T$151,COLUMNS('Input Wonen'!P:R),FALSE),\"\")","v":"Isover Mupan Ultra XS"}]
[null,null,null,null,"Daken",null,null,null,"Daken",null,null,null,"Daken"]
[null,null,null,"DA02.t",{"$f":"VLOOKUP(D611,'Input Wonen'!$D$13:$H$151,2,FALSE)","v":"Dakvloer: breedplaatvloer, 270mm incl. druklaag"},{"$f":"VLOOKUP(D611,'Input Wonen'!$D$13:$H$151,3,FALSE)","v":"Breedplaatvloer; incl. druklaag "},null,"DA02.HNN",{"$f":"IFERROR(VLOOKUP(H611,'Input Wonen'!$J$13:$N$151,COLUMNS('Input Wonen'!J:K),FALSE),\"\")","v":"Dakvloer: breedplaatvloer, 270mm incl. druklaag"},{"$f":"IFERROR(VLOOKUP(H611,'Input Wonen'!$J$13:$N$151,COLUMNS('Input Wonen'!J:L),FALSE),\"\")","v":"Breedplaatvloer; incl. druklaag (UMC)"},null,"DA02.E",{"$f":"IFERROR(VLOOKUP(L611,'Input Wonen'!$P$13:$T$151,COLUMNS('Input Wonen'!P:Q),FALSE),\"\")","v":"Dakconstructie, plat dak"},{"$f":"IFERROR(VLOOKUP(L611,'Input Wonen'!$P$13:$T$151,COLUMNS('Input Wonen'!P:R),FALSE),\"\")","v":"CLT excl. isolatie"}]
[null,null,null,"DA16.t",{"$f":"VLOOKUP(D612,'Input Wonen'!$D$13:$H$151,2,FALSE)","v":"Isolatielagen; plat dak; Rc=6,3"},{"$f":"VLOOKUP(D612,'Input Wonen'!$D$13:$H$151,3,FALSE)","v":"EPS"},null,"DA16.HNN",{"$f":"IFERROR(VLOOKUP(H612,'Input Wonen'!$J$13:$N$151,COLUMNS('Input Wonen'!J:K),FALSE),\"\")","v":"Isolatielagen; plat dak; Rc=6,3"},{"$f":"IFERROR(VLOOKUP(H612,'Input Wonen'!$J$13:$N$151,COLUMNS('Input Wonen'!J:L),FALSE),\"\")","v":"Houtvezel vlakke isolatieplaten"},null,"DA16.E",{"$f":"IFERROR(VLOOKUP(L612,'Input Wonen'!$P$13:$T$151,COLUMNS('Input Wonen'!P:Q),FALSE),\"\")","v":"Isolatielagen; plat dak; Rc=6,3"},{"$f":"IFERROR(VLOOKUP(L612,'Input Wonen'!$P$13:$T$151,COLUMNS('Input Wonen'!P:R),FALSE),\"\")","v":"Houtvezel vlakke isolatieplaten"}]
[null,null,null,"DA09.t",{"$f":"VLOOKUP(D613,'Input Wonen'!$D$13:$H$151,2,FALSE)","v":"Dakbedekking"},{"$f":"VLOOKUP(D613,'Input Wonen'!$D$13:$H$151,3,FALSE)","v":"Bitumen, gemod. eenlaags 4,3mm"},null,"DA09.HNN",{"$f":"IFERROR(VLOOKUP(H613,'Input Wonen'!$J$13:$N$151,COLUMNS('Input Wonen'!J:K),FALSE),\"\")","v":"Dakbedekking"},{"$f":"IFERROR(VLOOKUP(H613,'Input Wonen'!$J$13:$N$151,COLUMNS('Input Wonen'!J:L),FALSE),\"\")","v":"EPDM losmaakbare dakbedekking"},null,"DA09.E",{"$f":"IFERROR(VLOOKUP(L613,'Input Wonen'!$P$13:$T$151,COLUMNS('Input Wonen'!P:Q),FALSE),\"\")","v":"Dakbedekking"},{"$f":"IFERROR(VLOOKUP(L613,'Input Wonen'!$P$13:$T$151,COLUMNS('Input Wonen'!P:R),FALSE),\"\")","v":"EPDM losmaakbare dakbedekking"}]
[null,null,null,"DA43.t",{"$f":"VLOOKUP(D614,'Input Wonen'!$D$13:$H$151,2,FALSE)","v":"Dakrand binnenblad, 100mm"},{"$f":"VLOOKUP(D614,'Input Wonen'!$D$13:$H$151,3,FALSE)","v":"Cellenbeton blokken, XellaYtong"},null,"DA43.HNN",{"$f":"IFERROR(VLOOKUP(H614,'Input Wonen'!$J$13:$N$151,COLUMNS('Input Wonen'!J:K),FALSE),\"\")","v":"Dakrand binnenblad, 100mm"},{"$f":"IFERROR(VLOOKUP(H614,'Input Wonen'!$J$13:$N$151,COLUMNS('Input Wonen'!J:L),FALSE),\"\")","v":"Cellenbeton blokken, XellaYtong"},null,"DA43.E",{"$f":"IFERROR(VLOOKUP(L614,'Input Wonen'!$P$13:$T$151,COLUMNS('Input Wonen'!P:Q),FALSE),\"\")","v":"Dakrand binnenblad, 100mm"},{"$f":"IFERROR(VLOOKUP(L614,'Input Wonen'!$P$13:$T$151,COLUMNS('Input Wonen'!P:R),FALSE),\"\")","v":"HSB element incl. Isovlas isolatie"}]
[null,null,null,"GE09.t",{"$f":"VLOOKUP(D615,'Input Wonen'!$D$13:$H$151,2,FALSE)","v":"Buitenspouwblad, 100mm"},{"$f":"VLOOKUP(D615,'Input Wonen'!$D$13:$H$151,3,FALSE)","v":"Baksteenmetselwerk"},null,"GE09.HNN",{"$f":"IFERROR(VLOOKUP(H615,'Input Wonen'!$J$13:$N$151,COLUMNS('Input Wonen'!J:K),FALSE),\"\")","v":"Buitenspouwblad"},{"$f":"IFERROR(VLOOKUP(H615,'Input Wonen'!$J$13:$N$151,COLUMNS('Input Wonen'!J:L),FALSE),\"\")","v":"Ecobrick Wienerberger"},null,"GE09.E",{"$f":"IFERROR(VLOOKUP(L615,'Input Wonen'!$P$13:$T$151,COLUMNS('Input Wonen'!P:Q),FALSE),\"\")","v":"Buitenspouwblad"},{"$f":"IFERROR(VLOOKUP(L615,'Input Wonen'!$P$13:$T$151,COLUMNS('Input Wonen'!P:R),FALSE),\"\")","v":"Houten gevelbekleding; Meranti delen"}]
[null,null,null,"DA14.t",{"$f":"VLOOKUP(D616,'Input Wonen'!$D$13:$H$151,2,FALSE)","v":"Waterkeringen"},{"$f":"VLOOKUP(D616,'Input Wonen'!$D$13:$H$151,3,FALSE)","v":"Polyetheen; folie"},null,"DA14.HNN",{"$f":"IFERROR(VLOOKUP(H616,'Input Wonen'!$J$13:$N$151,COLUMNS('Input Wonen'!J:K),FALSE),\"\")","v":"Waterkeringen"},{"$f":"IFERROR(VLOOKUP(H616,'Input Wonen'!$J$13:$N$151,COLUMNS('Input Wonen'!J:L),FALSE),\"\")","v":"Polyetheen; folie"},null,"DA14.E",{"$f":"IFERROR(VLOOKUP(L616,'Input Wonen'!$P$13:$T$151,COLUMNS('Input Wonen'!P:Q),FALSE),\"\")","v":"Waterkeringen"},{"$f":"IFERROR(VLOOKUP(L616,'Input Wonen'!$P$13:$T$151,COLUMNS('Input Wonen'!P:R),FALSE),\"\")","v":"Polyetheen; folie"}]
[null,null,null,"DA04.t",{"$f":"VLOOKUP(D617,'Input Wonen'!$D$13:$H$151,2,FALSE)","v":"Dakafwerking"},{"$f":"VLOOKUP(D617,'Input Wonen'!$D$13:$H$151,3,FALSE)","v":"Daktrim; aluminium gemoffeld"},null,"DA04.HNN",{"$f":"IFERROR(VLOOKUP(H617,'Input Wonen'!$J$13:$N$151,COLUMNS('Input Wonen'!J:K),FALSE),\"\")","v":"Dakafwerking"},{"$f":"IFERROR(VLOOKUP(H617,'Input Wonen'!$J$13:$N$151,COLUMNS('Input Wonen'!J:L),FALSE),\"\")","v":"Daktrim; aluminium gemoffeld"},null,"DA04.E",{"$f":"IFERROR(VLOOKUP(L617,'Input Wonen'!$P$13:$T$151,COLUMNS('Input Wonen'!P:Q),FALSE),\"\")","v":"Dakafwerking"},{"$f":"IFERROR(VLOOKUP(L617,'Input Wonen'!$P$13:$T$151,COLUMNS('Input Wonen'!P:R),FALSE),\"\")","v":"Daktrim; aluminium gemoffeld"}]
[null,null,null,"DA15.t",{"$f":"VLOOKUP(D618,'Input Wonen'!$D$13:$H$151,2,FALSE)","v":"Dakafwerking"},{"$f":"VLOOKUP(D618,'Input Wonen'!$D$13:$H$151,3,FALSE)","v":"Rubbertegel; ballastlaag"},null,"DA15.HNN",{"$f":"IFERROR(VLOOKUP(H618,'Input Wonen'!$J$13:$N$151,COLUMNS('Input Wonen'!J:K),FALSE),\"\")","v":"Dakafwerking"},{"$f":"IFERROR(VLOOKUP(H618,'Input Wonen'!$J$13:$N$151,COLUMNS('Input Wonen'!J:L),FALSE),\"\")","v":"Rubbertegel; ballastlaag"},null,"DA15.E",{"$f":"IFERROR(VLOOKUP(L618,'Input Wonen'!$P$13:$T$151,COLUMNS('Input Wonen'!P:Q),FALSE),\"\")","v":"Dakafwerking"},{"$f":"IFERROR(VLOOKUP(L618,'Input Wonen'!$P$13:$T$151,COLUMNS('Input Wonen'!P:R),FALSE),\"\")","v":"Rubbertegel; ballastlaag"}]
[null,null,null,null,"Binnenwanden",null,null,null,"Binnenwanden",null,null,null,"Binnenwanden"]
[null,null,null,"BI01.t",{"$f":"VLOOKUP(D620,'Input Wonen'!$D$13:$H$151,2,FALSE)","v":"Dragende binnenwanden, 250mm; "},{"$f":"VLOOKUP(D620,'Input Wonen'!$D$13:$H$151,3,FALSE)","v":"I.h.w.g. beton"},null,"BI01.HNN",{"$f":"IFERROR(VLOOKUP(H620,'Input Wonen'!$J$13:$N$151,COLUMNS('Input Wonen'!J:K),FALSE),\"\")","v":"Dragende binnenwanden, 250mm; "},{"$f":"IFERROR(VLOOKUP(H620,'Input Wonen'!$J$13:$N$151,COLUMNS('Input Wonen'!J:L),FALSE),\"\")","v":"I.h.w.g. beton (UMC)"},null,"GE27.E",{"$f":"IFERROR(VLOOKUP(L620,'Input Wonen'!$P$13:$T$151,COLUMNS('Input Wonen'!P:Q),FALSE),\"\")","v":"Dragende binnenwanden"},{"$f":"IFERROR(VLOOKUP(L620,'Input Wonen'!$P$13:$T$151,COLUMNS('Input Wonen'!P:R),FALSE),\"\")","v":"CLT wanden"}]
[null,null,null,"BI15.t",{"$f":"VLOOKUP(D621,'Input Wonen'!$D$13:$H$151,2,FALSE)","v":"Binnenkozijnen"},{"$f":"VLOOKUP(D621,'Input Wonen'!$D$13:$H$151,3,FALSE)","v":"Staal; verzinkt+gemoffeld"},null,"BI15.HNN",{"$f":"IFERROR(VLOOKUP(H621,'Input Wonen'!$J$13:$N$151,COLUMNS('Input Wonen'!J:K),FALSE),\"\")","v":"Binnenkozijnen"},{"$f":"IFERROR(VLOOKUP(H621,'Input Wonen'!$J$13:$N$151,COLUMNS('Input Wonen'!J:L),FALSE),\"\")","v":"Staal; verzinkt+gemoffeld"},null,"BI15.E",{"$f":"IFERROR(VLOOKUP(L621,'Input Wonen'!$P$13:$T$151,COLUMNS('Input Wonen'!P:Q),FALSE),\"\")","v":"Binnenkozijnen"},{"$f":"IFERROR(VLOOKUP(L621,'Input Wonen'!$P$13:$T$151,COLUMNS('Input Wonen'!P:R),FALSE),\"\")","v":"Staal; verzinkt+gemoffeld"}]
[null,null,null,"BI17.t",{"$f":"VLOOKUP(D622,'Input Wonen'!$D$13:$H$151,2,FALSE)","v":"Binnenbeglazing"},{"$f":"VLOOKUP(D622,'Input Wonen'!$D$13:$H$151,3,FALSE)","v":"Enkel glas"},null,"BI17.HNN",{"$f":"IFERROR(VLOOKUP(H622,'Input Wonen'!$J$13:$N$151,COLUMNS('Input Wonen'!J:K),FALSE),\"\")","v":"Binnenbeglazing"},{"$f":"IFERROR(VLOOKUP(H622,'Input Wonen'!$J$13:$N$151,COLUMNS('Input Wonen'!J:L),FALSE),\"\")","v":"Enkel glas"},null,"BI17.E",{"$f":"IFERROR(VLOOKUP(L622,'Input Wonen'!$P$13:$T$151,COLUMNS('Input Wonen'!P:Q),FALSE),\"\")","v":"Binnenbeglazing"},{"$f":"IFERROR(VLOOKUP(L622,'Input Wonen'!$P$13:$T$151,COLUMNS('Input Wonen'!P:R),FALSE),\"\")","v":"Enkel glas"}]
[null,null,null,"BI08.t",{"$f":"VLOOKUP(D623,'Input Wonen'!$D$13:$H$151,2,FALSE)","v":"Binnendeuren"},{"$f":"VLOOKUP(D623,'Input Wonen'!$D$13:$H$151,3,FALSE)","v":"Honingraat; vlakke binnendeur"},null,"BI08.HNN",{"$f":"IFERROR(VLOOKUP(H623,'Input Wonen'!$J$13:$N$151,COLUMNS('Input Wonen'!J:K),FALSE),\"\")","v":"Binnendeuren"},{"$f":"IFERROR(VLOOKUP(H623,'Input Wonen'!$J$13:$N$151,COLUMNS('Input Wonen'!J:L),FALSE),\"\")","v":"Honingraat; vlakke binnendeur"},null,"BI08.E",{"$f":"IFERROR(VLOOKUP(L623,'Input Wonen'!$P$13:$T$151,COLUMNS('Input Wonen'!P:Q),FALSE),\"\")","v":"Binnendeuren"},{"$f":"IFERROR(VLOOKUP(L623,'Input Wonen'!$P$13:$T$151,COLUMNS('Input Wonen'!P:R),FALSE),\"\")","v":"Honingraat; vlakke binnendeur"}]
[null,null,null,"BI03.t",{"$f":"VLOOKUP(D624,'Input Wonen'!$D$13:$H$151,2,FALSE)","v":"Binnenwanden, 100mm"},{"$f":"VLOOKUP(D624,'Input Wonen'!$D$13:$H$151,3,FALSE)","v":"Kalkzandsteen lijmblokken, 100mm"},null,"BI03.HNN",{"$f":"IFERROR(VLOOKUP(H624,'Input Wonen'!$J$13:$N$151,COLUMNS('Input Wonen'!J:K),FALSE),\"\")","v":"Binnenwanden, 100mm"},{"$f":"IFERROR(VLOOKUP(H624,'Input Wonen'!$J$13:$N$151,COLUMNS('Input Wonen'!J:L),FALSE),\"\")","v":"Faay volpaneel"},null,"BI03.E",{"$f":"IFERROR(VLOOKUP(L624,'Input Wonen'!$P$13:$T$151,COLUMNS('Input Wonen'!P:Q),FALSE),\"\")","v":"Binnenwanden, 100mm"},{"$f":"IFERROR(VLOOKUP(L624,'Input Wonen'!$P$13:$T$151,COLUMNS('Input Wonen'!P:R),FALSE),\"\")","v":"Faay volpaneel"}]
[null,null,null,"BI05.t",{"$f":"VLOOKUP(D625,'Input Wonen'!$D$13:$H$151,2,FALSE)","v":"Binnenwanden, 70mm"},{"$f":"VLOOKUP(D625,'Input Wonen'!$D$13:$H$151,3,FALSE)","v":"Gipsblokken, normale dichtheid"},null,"BI05.HNN",{"$f":"IFERROR(VLOOKUP(H625,'Input Wonen'!$J$13:$N$151,COLUMNS('Input Wonen'!J:K),FALSE),\"\")","v":"Binnenwanden, 70mm"},{"$f":"IFERROR(VLOOKUP(H625,'Input Wonen'!$J$13:$N$151,COLUMNS('Input Wonen'!J:L),FALSE),\"\")","v":"Faay volpaneel"},null,"BI05.E",{"$f":"IFERROR(VLOOKUP(L625,'Input Wonen'!$P$13:$T$151,COLUMNS('Input Wonen'!P:Q),FALSE),\"\")","v":"Binnenwanden, 70mm"},{"$f":"IFERROR(VLOOKUP(L625,'Input Wonen'!$P$13:$T$151,COLUMNS('Input Wonen'!P:R),FALSE),\"\")","v":"Faay volpaneel"}]
[null,null,null,"BI14.t",{"$f":"VLOOKUP(D626,'Input Wonen'!$D$13:$H$151,2,FALSE)","v":"Systeemwanden; gipskartonplaat, 100mm"},{"$f":"VLOOKUP(D626,'Input Wonen'!$D$13:$H$151,3,FALSE)","v":"Enkel beplaat, 60 mm glaswol"},null,"BI14.HNN",{"$f":"IFERROR(VLOOKUP(H626,'Input Wonen'!$J$13:$N$151,COLUMNS('Input Wonen'!J:K),FALSE),\"\")","v":"Binnenwanden, 35mm"},{"$f":"IFERROR(VLOOKUP(H626,'Input Wonen'!$J$13:$N$151,COLUMNS('Input Wonen'!J:L),FALSE),\"\")","v":"Faay volpaneel"},null,"BI14.E",{"$f":"IFERROR(VLOOKUP(L626,'Input Wonen'!$P$13:$T$151,COLUMNS('Input Wonen'!P:Q),FALSE),\"\")","v":"Binnenwanden, 54mm"},{"$f":"IFERROR(VLOOKUP(L626,'Input Wonen'!$P$13:$T$151,COLUMNS('Input Wonen'!P:R),FALSE),\"\")","v":"Faay volpaneel; enkel beplaat"}]
[null,null,null,"BI04.t",{"$f":"VLOOKUP(D627,'Input Wonen'!$D$13:$H$151,2,FALSE)","v":"Wandtegelwerk badkamer, toilet en keuken"},{"$f":"VLOOKUP(D627,'Input Wonen'!$D$13:$H$151,3,FALSE)","v":"Keramische tegels; geglazuurd/gelijmd"},null,"BI04.HNN",{"$f":"IFERROR(VLOOKUP(H627,'Input Wonen'!$J$13:$N$151,COLUMNS('Input Wonen'!J:K),FALSE),\"\")","v":"Wandtegelwerk badkamer, toilet en keuken"},{"$f":"IFERROR(VLOOKUP(H627,'Input Wonen'!$J$13:$N$151,COLUMNS('Input Wonen'!J:L),FALSE),\"\")","v":"Mosa C2C wandtegels"},null,"BI04.E",{"$f":"IFERROR(VLOOKUP(L627,'Input Wonen'!$P$13:$T$151,COLUMNS('Input Wonen'!P:Q),FALSE),\"\")","v":"Wandtegelwerk badkamer, toilet en keuken"},{"$f":"IFERROR(VLOOKUP(L627,'Input Wonen'!$P$13:$T$151,COLUMNS('Input Wonen'!P:R),FALSE),\"\")","v":"Gerecycled PET i.c.m. Quartz"}]
[null,null,null,null,"Klimaatinstallaties",null,null,null,"Klimaatinstallaties",null,null,null,"Klimaatinstallaties"]
[null,null,null,"KL06.t",{"$f":"VLOOKUP(D629,'Input Wonen'!$D$13:$H$151,2,FALSE)","v":"Waterleidingen, verwarmd tapwater"},{"$f":"VLOOKUP(D629,'Input Wonen'!$D$13:$H$151,3,FALSE)","v":"PVC, incl. mantelbuis 15mm; W-bouw"},null,"KL06.HNN",{"$f":"IFERROR(VLOOKUP(H629,'Input Wonen'!$J$13:$N$151,COLUMNS('Input Wonen'!J:K),FALSE),\"\")","v":"Waterleidingen, verwarmd tapwater"},{"$f":"IFERROR(VLOOKUP(H629,'Input Wonen'!$J$13:$N$151,COLUMNS('Input Wonen'!J:L),FALSE),\"\")","v":"PVC, incl. mantelbuis 15mm; W-bouw"},null,"KL06.E",{"$f":"IFERROR(VLOOKUP(L629,'Input Wonen'!$P$13:$T$151,COLUMNS('Input Wonen'!P:Q),FALSE),\"\")","v":"Waterleidingen, verwarmd tapwater"},{"$f":"IFERROR(VLOOKUP(L629,'Input Wonen'!$P$13:$T$151,COLUMNS('Input Wonen'!P:R),FALSE),\"\")","v":"PVC, incl. mantelbuis 15mm; W-bouw"}]
[null,null,null,"KL07.t",{"$f":"VLOOKUP(D630,'Input Wonen'!$D$13:$H$151,2,FALSE)","v":"Warmtapwaterinstallatie"},{"$f":"VLOOKUP(D630,'Input Wonen'!$D$13:$H$151,3,FALSE)","v":"Elektrische boiler; CW:4-6 120 liter"},null,"KL07.HNN",{"$f":"IFERROR(VLOOKUP(H630,'Input Wonen'!$J$13:$N$151,COLUMNS('Input Wonen'!J:K),FALSE),\"\")","v":"Warmtapwaterinstallatie"},{"$f":"IFERROR(VLOOKUP(H630,'Input Wonen'!$J$13:$N$151,COLUMNS('Input Wonen'!J:L),FALSE),\"\")","v":"Elektrische boiler; CW:4-6 120 liter"},null,"KL07.E",{"$f":"IFERROR(VLOOKUP(L630,'Input Wonen'!$P$13:$T$151,COLUMNS('Input Wonen'!P:Q),FALSE),\"\")","v":"Warmtapwaterinstallatie"},{"$f":"IFERROR(VLOOKUP(L630,'Input Wonen'!$P$13:$T$151,COLUMNS('Input Wonen'!P:R),FALSE),\"\")","v":"Elektrische boiler; CW:4-6 120 liter"}]
[null,null,null,"KL03.t",{"$f":"VLOOKUP(D631,'Input Wonen'!$D$13:$H$151,2,FALSE)","v":"Warmteafgiftesysteem"},{"$f":"VLOOKUP(D631,'Input Wonen'!$D$13:$H$151,3,FALSE)","v":"Vloerverwarming 95 W/m2"},null,"KL03.HNN",{"$f":"IFERROR(VLOOKUP(H631,'Input Wonen'!$J$13:$N$151,COLUMNS('Input Wonen'!J:K),FALSE),\"\")","v":"Warmteafgiftesysteem"},{"$f":"IFERROR(VLOOKUP(H631,'Input Wonen'!$J$13:$N$151,COLUMNS('Input Wonen'!J:L),FALSE),\"\")","v":"Vloerverwarming 95 W/m2"},null,"KL03.E",{"$f":"IFERROR(VLOOKUP(L631,'Input Wonen'!$P$13:$T$151,COLUMNS('Input Wonen'!P:Q),FALSE),\"\")","v":"Warmteafgiftesysteem"},{"$f":"IFERROR(VLOOKUP(L631,'Input Wonen'!$P$13:$T$151,COLUMNS('Input Wonen'!P:R),FALSE),\"\")","v":"Vloerverwarming 95 W/m2 "}]
[null,null,null,"KL08.t",{"$f":"VLOOKUP(D632,'Input Wonen'!$D$13:$H$151,2,FALSE)","v":"Warmteopwekkinginstallatie"},{"$f":"VLOOKUP(D632,'Input Wonen'!$D$13:$H$151,3,FALSE)","v":"Warmtepomp luchtwater 10kW"},null,"KL08.HNN",{"$f":"IFERROR(VLOOKUP(H632,'Input Wonen'!$J$13:$N$151,COLUMNS('Input Wonen'!J:K),FALSE),\"\")","v":"Warmteopwekkinginstallatie"},{"$f":"IFERROR(VLOOKUP(H632,'Input Wonen'!$J$13:$N$151,COLUMNS('Input Wonen'!J:L),FALSE),\"\")","v":"Warmtepomp luchtwater 10kW"},null,"KL08.E",{"$f":"IFERROR(VLOOKUP(L632,'Input Wonen'!$P$13:$T$151,COLUMNS('Input Wonen'!P:Q),FALSE),\"\")","v":"Warmteopwekkinginstallatie"},{"$f":"IFERROR(VLOOKUP(L632,'Input Wonen'!$P$13:$T$151,COLUMNS('Input Wonen'!P:R),FALSE),\"\")","v":"Warmtepomp luchtwater 10kW"}]
[null,null,null,"KL05.t",{"$f":"VLOOKUP(D633,'Input Wonen'!$D$13:$H$151,2,FALSE)","v":"Luchtdistributiesysteem"},{"$f":"VLOOKUP(D633,'Input Wonen'!$D$13:$H$151,3,FALSE)","v":"VLA ventilatiesysteem, type D met centrale wtw; W-bouw, individueel"},null,"KL05.HNN",{"$f":"IFERROR(VLOOKUP(H633,'Input Wonen'!$J$13:$N$151,COLUMNS('Input Wonen'!J:K),FALSE),\"\")","v":"Luchtdistributiesysteem"},{"$f":"IFERROR(VLOOKUP(H633,'Input Wonen'!$J$13:$N$151,COLUMNS('Input Wonen'!J:L),FALSE),\"\")","v":"VLA ventilatiesysteem, type D met centrale wtw; W-bouw, individueel"},null,"KL05.E",{"$f":"IFERROR(VLOOKUP(L633,'Input Wonen'!$P$13:$T$151,COLUMNS('Input Wonen'!P:Q),FALSE),\"\")","v":"Luchtdistributiesysteem"},{"$f":"IFERROR(VLOOKUP(L633,'Input Wonen'!$P$13:$T$151,COLUMNS('Input Wonen'!P:R),FALSE),\"\")","v":"VLA ventilatiesysteem, type D met centrale wtw; W-bouw, individueel"}]
[null,null,null,null,"Elektrische installaties",null,null,null,"Elektrische installaties",null,null,null,"Elektrische installaties"]
[null,null,null,"EL05.t",{"$f":"VLOOKUP(D635,'Input Wonen'!$D$13:$H$151,2,FALSE)","v":"Elektriciteitsleidingen"},{"$f":"VLOOKUP(D635,'Input Wonen'!$D$13:$H$151,3,FALSE)","v":"Koper met PP-isolatie"},null,"EL05.HNN",{"$f":"IFERROR(VLOOKUP(H635,'Input Wonen'!$J$13:$N$151,COLUMNS('Input Wonen'!J:K),FALSE),\"\")","v":"Elektriciteitsleidingen"},{"$f":"IFERROR(VLOOKUP(H635,'Input Wonen'!$J$13:$N$151,COLUMNS('Input Wonen'!J:L),FALSE),\"\")","v":"Koper met PP-isolatie"},null,"EL05.E",{"$f":"IFERROR(VLOOKUP(L635,'Input Wonen'!$P$13:$T$151,COLUMNS('Input Wonen'!P:Q),FALSE),\"\")","v":"Elektriciteitsleidingen"},{"$f":"IFERROR(VLOOKUP(L635,'Input Wonen'!$P$13:$T$151,COLUMNS('Input Wonen'!P:R),FALSE),\"\")","v":"Koper met PP-isolatie"}]
[null,null,null,"EL03.t",{"$f":"VLOOKUP(D636,'Input Wonen'!$D$13:$H$151,2,FALSE)","v":"Pv-panelen, plat dak"},{"$f":"VLOOKUP(D636,'Input Wonen'!$D$13:$H$151,3,FALSE)","v":"Mono-Si; incl. inverter+kabels"},null,"EL03.HNN",{"$f":"IFERROR(VLOOKUP(H636,'Input Wonen'!$J$13:$N$151,COLUMNS('Input Wonen'!J:K),FALSE),\"\")","v":"Pv-panelen, plat dak"},{"$f":"IFERROR(VLOOKUP(H636,'Input Wonen'!$J$13:$N$151,COLUMNS('Input Wonen'!J:L),FALSE),\"\")","v":"Exasun Xglass"},null,"EL03.E",{"$f":"IFERROR(VLOOKUP(L636,'Input Wonen'!$P$13:$T$151,COLUMNS('Input Wonen'!P:Q),FALSE),\"\")","v":"Pv-panelen, plat dak"},{"$f":"IFERROR(VLOOKUP(L636,'Input Wonen'!$P$13:$T$151,COLUMNS('Input Wonen'!P:R),FALSE),\"\")","v":"Exasun Xglass"}]
[null,null,null,"EL04.t",{"$f":"VLOOKUP(D637,'Input Wonen'!$D$13:$H$151,2,FALSE)","v":"Verlichting"},{"$f":"VLOOKUP(D637,'Input Wonen'!$D$13:$H$151,3,FALSE)","v":"LED-120cm"},null,"EL04.HNN",{"$f":"IFERROR(VLOOKUP(H637,'Input Wonen'!$J$13:$N$151,COLUMNS('Input Wonen'!J:K),FALSE),\"\")","v":"Verlichting"},{"$f":"IFERROR(VLOOKUP(H637,'Input Wonen'!$J$13:$N$151,COLUMNS('Input Wonen'!J:L),FALSE),\"\")","v":"LED-120cm"},null,"EL04.E",{"$f":"IFERROR(VLOOKUP(L637,'Input Wonen'!$P$13:$T$151,COLUMNS('Input Wonen'!P:Q),FALSE),\"\")","v":"Verlichting"},{"$f":"IFERROR(VLOOKUP(L637,'Input Wonen'!$P$13:$T$151,COLUMNS('Input Wonen'!P:R),FALSE),\"\")","v":"LED-120cm"}]
[null,null,null,null,"Toe- en afvoeren",null,null,null,"Toe- en afvoeren",null,null,null,"Toe- en afvoeren"]
[null,null,null,"TO01.t",{"$f":"VLOOKUP(D639,'Input Wonen'!$D$13:$H$151,2,FALSE)","v":"Waterleidingen"},{"$f":"VLOOKUP(D639,'Input Wonen'!$D$13:$H$151,3,FALSE)","v":"Polyetheen; leiding+mantelbuis"},null,"TO01.HNN",{"$f":"IFERROR(VLOOKUP(H639,'Input Wonen'!$J$13:$N$151,COLUMNS('Input Wonen'!J:K),FALSE),\"\")","v":"Waterleidingen"},{"$f":"IFERROR(VLOOKUP(H639,'Input Wonen'!$J$13:$N$151,COLUMNS('Input Wonen'!J:L),FALSE),\"\")","v":"Polyetheen"},null,"TO01.E",{"$f":"IFERROR(VLOOKUP(L639,'Input Wonen'!$P$13:$T$151,COLUMNS('Input Wonen'!P:Q),FALSE),\"\")","v":"Waterleidingen"},{"$f":"IFERROR(VLOOKUP(L639,'Input Wonen'!$P$13:$T$151,COLUMNS('Input Wonen'!P:R),FALSE),\"\")","v":"Polyetheen"}]
[null,null,null,"TO02.t",{"$f":"VLOOKUP(D640,'Input Wonen'!$D$13:$H$151,2,FALSE)","v":"Buitenriolering kavel"},{"$f":"VLOOKUP(D640,'Input Wonen'!$D$13:$H$151,3,FALSE)","v":"PVC"},null,"TO02.HNN",{"$f":"IFERROR(VLOOKUP(H640,'Input Wonen'!$J$13:$N$151,COLUMNS('Input Wonen'!J:K),FALSE),\"\")","v":"Buitenriolering"},{"$f":"IFERROR(VLOOKUP(H640,'Input Wonen'!$J$13:$N$151,COLUMNS('Input Wonen'!J:L),FALSE),\"\")","v":"Gerecycled PVC (Pipelife)"},null,"TO02.E",{"$f":"IFERROR(VLOOKUP(L640,'Input Wonen'!$P$13:$T$151,COLUMNS('Input Wonen'!P:Q),FALSE),\"\")","v":"Buitenriolering"},{"$f":"IFERROR(VLOOKUP(L640,'Input Wonen'!$P$13:$T$151,COLUMNS('Input Wonen'!P:R),FALSE),\"\")","v":"Gerecycled PVC (Pipelife)"}]
[null,null,null,"TO03.t",{"$f":"VLOOKUP(D641,'Input Wonen'!$D$13:$H$151,2,FALSE)","v":"Binnenriolering"},{"$f":"VLOOKUP(D641,'Input Wonen'!$D$13:$H$151,3,FALSE)","v":"PVC"},null,"TO03.HNN",{"$f":"IFERROR(VLOOKUP(H641,'Input Wonen'!$J$13:$N$151,COLUMNS('Input Wonen'!J:K),FALSE),\"\")","v":"Binnenriolering"},{"$f":"IFERROR(VLOOKUP(H641,'Input Wonen'!$J$13:$N$151,COLUMNS('Input Wonen'!J:L),FALSE),\"\")","v":"Gerecycled PVC (Pipelife)"},null,"TO03.E",{"$f":"IFERROR(VLOOKUP(L641,'Input Wonen'!$P$13:$T$151,COLUMNS('Input Wonen'!P:Q),FALSE),\"\")","v":"Binnenriolering"},{"$f":"IFERROR(VLOOKUP(L641,'Input Wonen'!$P$13:$T$151,COLUMNS('Input Wonen'!P:R),FALSE),\"\")","v":"Gerecycled PVC (Pipelife)"}]
[null,null,null,"TO04.t",{"$f":"VLOOKUP(D642,'Input Wonen'!$D$13:$H$151,2,FALSE)","v":"Hemelwaterafvoer"},{"$f":"VLOOKUP(D642,'Input Wonen'!$D$13:$H$151,3,FALSE)","v":"PVC"},null,"TO04.HNN",{"$f":"IFERROR(VLOOKUP(H642,'Input Wonen'!$J$13:$N$151,COLUMNS('Input Wonen'!J:K),FALSE),\"\")","v":"Hemelwaterafvoer"},{"$f":"IFERROR(VLOOKUP(H642,'Input Wonen'!$J$13:$N$151,COLUMNS('Input Wonen'!J:L),FALSE),\"\")","v":"Gerecycled PVC (Pipelife)"},null,"TO04.E",{"$f":"IFERROR(VLOOKUP(L642,'Input Wonen'!$P$13:$T$151,COLUMNS('Input Wonen'!P:Q),FALSE),\"\")","v":"Hemelwaterafvoer"},{"$f":"IFERROR(VLOOKUP(L642,'Input Wonen'!$P$13:$T$151,COLUMNS('Input Wonen'!P:R),FALSE),\"\")","v":"Gerecycled PVC (Pipelife)"}]
[null,null,null,null,"Verkeersruimte",null,null,null,"Verkeersruimte",null,null,null,"Verkeersruimte"]
[null,null,null,"VE02.t",{"$f":"VLOOKUP(D644,'Input Wonen'!$D$13:$H$151,2,FALSE)","v":"Centrale trap"},{"$f":"VLOOKUP(D644,'Input Wonen'!$D$13:$H$151,3,FALSE)","v":"Prefab beton"},null,"VE02.HNN",{"$f":"IFERROR(VLOOKUP(H644,'Input Wonen'!$J$13:$N$151,COLUMNS('Input Wonen'!J:K),FALSE),\"\")","v":"Centrale trap"},{"$f":"IFERROR(VLOOKUP(H644,'Input Wonen'!$J$13:$N$151,COLUMNS('Input Wonen'!J:L),FALSE),\"\")","v":"Prefab beton"},null,"VE02.E",{"$f":"IFERROR(VLOOKUP(L644,'Input Wonen'!$P$13:$T$151,COLUMNS('Input Wonen'!P:Q),FALSE),\"\")","v":"Centrale trap"},{"$f":"IFERROR(VLOOKUP(L644,'Input Wonen'!$P$13:$T$151,COLUMNS('Input Wonen'!P:R),FALSE),\"\")","v":"Prefab beton"}]
[null,null,null,"VE10.t",{"$f":"VLOOKUP(D645,'Input Wonen'!$D$13:$H$151,2,FALSE)","v":"Centrale trap"},{"$f":"VLOOKUP(D645,'Input Wonen'!$D$13:$H$151,3,FALSE)","v":"Staal met Meranti treden"},null,"VE10.HNN",{"$f":"IFERROR(VLOOKUP(H645,'Input Wonen'!$J$13:$N$151,COLUMNS('Input Wonen'!J:K),FALSE),\"\")","v":"Centrale trap"},{"$f":"IFERROR(VLOOKUP(H645,'Input Wonen'!$J$13:$N$151,COLUMNS('Input Wonen'!J:L),FALSE),\"\")","v":"Staal met Meranti treden"},null,"VE10.E",{"$f":"IFERROR(VLOOKUP(L645,'Input Wonen'!$P$13:$T$151,COLUMNS('Input Wonen'!P:Q),FALSE),\"\")","v":"Centrale trap"},{"$f":"IFERROR(VLOOKUP(L645,'Input Wonen'!$P$13:$T$151,COLUMNS('Input Wonen'!P:R),FALSE),\"\")","v":"Staal met Meranti treden"}]
[null,null,null,"VE06.t",{"$f":"VLOOKUP(D646,'Input Wonen'!$D$13:$H$151,2,FALSE)","v":"Leuningen"},{"$f":"VLOOKUP(D646,'Input Wonen'!$D$13:$H$151,3,FALSE)","v":"Aluminium"},null,"VE06.HNN",{"$f":"IFERROR(VLOOKUP(H646,'Input Wonen'!$J$13:$N$151,COLUMNS('Input Wonen'!J:K),FALSE),\"\")","v":"Leuningen"},{"$f":"IFERROR(VLOOKUP(H646,'Input Wonen'!$J$13:$N$151,COLUMNS('Input Wonen'!J:L),FALSE),\"\")","v":"Aluminium"},null,"VE06.E",{"$f":"IFERROR(VLOOKUP(L646,'Input Wonen'!$P$13:$T$151,COLUMNS('Input Wonen'!P:Q),FALSE),\"\")","v":"Leuningen"},{"$f":"IFERROR(VLOOKUP(L646,'Input Wonen'!$P$13:$T$151,COLUMNS('Input Wonen'!P:R),FALSE),\"\")","v":"Aluminium"}]
[null,null,null,"VE09.t",{"$f":"VLOOKUP(D647,'Input Wonen'!$D$13:$H$151,2,FALSE)","v":"Balustrades"},{"$f":"VLOOKUP(D647,'Input Wonen'!$D$13:$H$151,3,FALSE)","v":"Staal; gepoedercoat; spijlen"},null,"VE09.HNN",{"$f":"IFERROR(VLOOKUP(H647,'Input Wonen'!$J$13:$N$151,COLUMNS('Input Wonen'!J:K),FALSE),\"\")","v":"Balustrades"},{"$f":"IFERROR(VLOOKUP(H647,'Input Wonen'!$J$13:$N$151,COLUMNS('Input Wonen'!J:L),FALSE),\"\")","v":"Staal; gepoedercoat; spijlen"},null,"VE09.E",{"$f":"IFERROR(VLOOKUP(L647,'Input Wonen'!$P$13:$T$151,COLUMNS('Input Wonen'!P:Q),FALSE),\"\")","v":"Balustrades"},{"$f":"IFERROR(VLOOKUP(L647,'Input Wonen'!$P$13:$T$151,COLUMNS('Input Wonen'!P:R),FALSE),\"\")","v":"Staal; gepoedercoat; spijlen"}]
[null,null,null,"VE08.t",{"$f":"VLOOKUP(D648,'Input Wonen'!$D$13:$H$151,2,FALSE)","v":"Liftinstallatie"},{"$f":"VLOOKUP(D648,'Input Wonen'!$D$13:$H$151,3,FALSE)","v":"Staal"},null,"VE08.HNN",{"$f":"IFERROR(VLOOKUP(H648,'Input Wonen'!$J$13:$N$151,COLUMNS('Input Wonen'!J:K),FALSE),\"\")","v":"Liftinstallatie"},{"$f":"IFERROR(VLOOKUP(H648,'Input Wonen'!$J$13:$N$151,COLUMNS('Input Wonen'!J:L),FALSE),\"\")","v":"Staal"},null,"VE08.E",{"$f":"IFERROR(VLOOKUP(L648,'Input Wonen'!$P$13:$T$151,COLUMNS('Input Wonen'!P:Q),FALSE),\"\")","v":"Liftinstallatie"},{"$f":"IFERROR(VLOOKUP(L648,'Input Wonen'!$P$13:$T$151,COLUMNS('Input Wonen'!P:R),FALSE),\"\")","v":"Staal"}]
[null,null,null,null,"Vaste voorzieningen",null,null,null,"Vaste voorzieningen",null,null,null,"Vaste voorzieningen"]
[null,null,null,"VA01.t",{"$f":"VLOOKUP(D650,'Input Wonen'!$D$13:$H$151,2,FALSE)","v":"Toiletten; wandcloset + fontein"},{"$f":"VLOOKUP(D650,'Input Wonen'!$D$13:$H$151,3,FALSE)","v":"Porselein"},null,"VA01.HNN",{"$f":"IFERROR(VLOOKUP(H650,'Input Wonen'!$J$13:$N$151,COLUMNS('Input Wonen'!J:K),FALSE),\"\")","v":"Toiletten; wandcloset + fontein"},{"$f":"IFERROR(VLOOKUP(H650,'Input Wonen'!$J$13:$N$151,COLUMNS('Input Wonen'!J:L),FALSE),\"\")","v":"Porselein"},null,"VA01.E",{"$f":"IFERROR(VLOOKUP(L650,'Input Wonen'!$P$13:$T$151,COLUMNS('Input Wonen'!P:Q),FALSE),\"\")","v":"Toiletten; wandcloset + fontein"},{"$f":"IFERROR(VLOOKUP(L650,'Input Wonen'!$P$13:$T$151,COLUMNS('Input Wonen'!P:R),FALSE),\"\")","v":"Porselein"}]
[null,null,null,"VA02.t",{"$f":"VLOOKUP(D651,'Input Wonen'!$D$13:$H$151,2,FALSE)","v":"Wastafel"},{"$f":"VLOOKUP(D651,'Input Wonen'!$D$13:$H$151,3,FALSE)","v":"Keramisch"},null,"VA02.HNN",{"$f":"IFERROR(VLOOKUP(H651,'Input Wonen'!$J$13:$N$151,COLUMNS('Input Wonen'!J:K),FALSE),\"\")","v":"Wastafel"},{"$f":"IFERROR(VLOOKUP(H651,'Input Wonen'!$J$13:$N$151,COLUMNS('Input Wonen'!J:L),FALSE),\"\")","v":"Keramisch"},null,"VA02.E",{"$f":"IFERROR(VLOOKUP(L651,'Input Wonen'!$P$13:$T$151,COLUMNS('Input Wonen'!P:Q),FALSE),\"\")","v":"Wastafel"},{"$f":"IFERROR(VLOOKUP(L651,'Input Wonen'!$P$13:$T$151,COLUMNS('Input Wonen'!P:R),FALSE),\"\")","v":"Keramisch"}]
[null,null,null,"VA03.t",{"$f":"VLOOKUP(D652,'Input Wonen'!$D$13:$H$151,2,FALSE)","v":"Inloopdouche"},{"$f":"VLOOKUP(D652,'Input Wonen'!$D$13:$H$151,3,FALSE)","v":"Gipsblokken + tegels incl. rvs afvoergoot"},null,"VA03.HNN",{"$f":"IFERROR(VLOOKUP(H652,'Input Wonen'!$J$13:$N$151,COLUMNS('Input Wonen'!J:K),FALSE),\"\")","v":"Inloopdouche"},{"$f":"IFERROR(VLOOKUP(H652,'Input Wonen'!$J$13:$N$151,COLUMNS('Input Wonen'!J:L),FALSE),\"\")","v":"Gipsblokken + tegels incl. rvs afvoergoot"},null,"VA03.E",{"$f":"IFERROR(VLOOKUP(L652,'Input Wonen'!$P$13:$T$151,COLUMNS('Input Wonen'!P:Q),FALSE),\"\")","v":"Inloopdouche"},{"$f":"IFERROR(VLOOKUP(L652,'Input Wonen'!$P$13:$T$151,COLUMNS('Input Wonen'!P:R),FALSE),\"\")","v":"Gipsblokken + tegels incl. rvs afvoergoot"}]
[null,null,null,null,"Overige kosten",null,null,null,"Overige kosten",null,null,null,"Overige kosten"]
[null,null,null,"OK01.t",{"$f":"VLOOKUP(D654,'Input Wonen'!$D$13:$H$165,2,FALSE)","v":"Grondwerk, maatvoering, invoeren en sparingen"},null,null,"OK01.HNN",{"$f":"VLOOKUP(H654,'Input Wonen'!$J$13:$N$165,2,FALSE)","v":"Grondwerk, maatvoering, invoeren en sparingen"},null,null,"OK01.E",{"$f":"VLOOKUP(H654,'Input Wonen'!$J$13:$N$165,2,FALSE)","v":"Grondwerk, maatvoering, invoeren en sparingen"}]
[null,null,null,"OK02.t",{"$f":"VLOOKUP(D655,'Input Wonen'!$D$13:$H$165,2,FALSE)","v":"Gevelsteiger"},null,null,"OK02.HNN",{"$f":"VLOOKUP(H655,'Input Wonen'!$J$13:$N$165,2,FALSE)","v":"Gevelsteiger"},null,null,"OK02.E",{"$f":"VLOOKUP(H655,'Input Wonen'!$J$13:$N$165,2,FALSE)","v":"Gevelsteiger"}]
[null,null,null,"OK03.t",{"$f":"VLOOKUP(D656,'Input Wonen'!$D$13:$H$165,2,FALSE)","v":"Dakvalbeveiliging en inplakken van doorvoeren"},null,null,"OK03.HNN",{"$f":"VLOOKUP(H656,'Input Wonen'!$J$13:$N$165,2,FALSE)","v":"Dakvalbeveiliging en inplakken van doorvoeren"},null,null,"OK03.E",{"$f":"VLOOKUP(H656,'Input Wonen'!$J$13:$N$165,2,FALSE)","v":"Dakvalbeveiliging en inplakken van doorvoeren"}]
[null,null,null,"OK04.t",{"$f":"VLOOKUP(D657,'Input Wonen'!$D$13:$H$165,2,FALSE)","v":"Afbouwwerkzaamheden (klein timmerwerk, schilderwerk)"},null,null,"OK04.HNN",{"$f":"VLOOKUP(H657,'Input Wonen'!$J$13:$N$165,2,FALSE)","v":"Afbouwwerkzaamheden (klein timmerwerk, schilderwerk)"},null,null,"OK04.E",{"$f":"VLOOKUP(H657,'Input Wonen'!$J$13:$N$165,2,FALSE)","v":"Afbouwwerkzaamheden (klein timmerwerk, schilderwerk)"}]
[null,null,null,"OK05.t",{"$f":"VLOOKUP(D658,'Input Wonen'!$D$13:$H$165,2,FALSE)","v":"Bouwkundige voorzieningen ten behoeve van installaties"},null,null,"OK05.HNN",{"$f":"VLOOKUP(H658,'Input Wonen'!$J$13:$N$165,2,FALSE)","v":"Bouwkundige voorzieningen ten behoeve van installaties"},null,null,"OK05.E",{"$f":"VLOOKUP(H658,'Input Wonen'!$J$13:$N$165,2,FALSE)","v":"Bouwkundige voorzieningen ten behoeve van installaties"}]
[null,null,null,"OK11b.t",{"$f":"VLOOKUP(D659,'Input Wonen'!$D$13:$H$172,2,FALSE)","v":"Installaties (E, W & klimaat) gallerij"},null,null,"OK11b.HNN",{"$f":"VLOOKUP(H659,'Input Wonen'!$J$13:$N$172,2,FALSE)","v":"Installaties (E, W & klimaat) gallerij"},null,null,"OK11b.E",{"$f":"VLOOKUP(H659,'Input Wonen'!$J$13:$N$172,2,FALSE)","v":"Installaties (E, W & klimaat) gallerij"}]

{"sheet":"Input P1","index":2,"n_rows":479,"n_cols":20,"rows_kept":479,"cut":false,"hidden":true,"merged":[[256,12,257,12],[256,15,257,15],[256,16,257,16],[3,5,3,8],[25,4,25,9],[25,11,25,16],[26,4,27,4],[26,5,27,5],[26,6,27,6],[26,7,27,7],[26,8,27,8],[26,9,27,9],[26,11,27,11],[31,4,31,9],[31,11,31,16],[42,4,42,9],[42,11,42,16],[55,4,55,9],[55,11,55,16],[26,12,27,12],[26,13,27,13],[26,14,27,14],[26,15,27,15],[26,16,27,16],[28,4,28,9],[28,11,28,16],[84,4,84,9],[84,11,84,16],[88,4,88,9],[88,11,88,16],[95,4,95,9],[95,11,95,16],[70,4,70,9],[70,11,70,16],[75,4,75,9],[75,11,75,16],[78,4,78,9],[78,11,78,16],[96,11,97,11],[96,12,97,12],[96,13,97,13],[96,14,97,14],[96,15,97,15],[96,16,97,16],[96,4,97,4],[96,5,97,5],[96,6,97,6],[96,7,97,7],[96,8,97,8],[96,9,97,9],[113,4,113,9],[113,11,113,16],[126,4,126,9],[126,11,126,16],[135,4,135,9],[135,11,135,16],[98,4,98,9],[98,11,98,16],[101,4,101,9],[101,11,101,16],[111,4,111,9],[111,11,111,16],[157,4,157,9],[157,11,157,16],[161,4,161,9],[161,11,161,16],[168,4,168,9],[168,11,168,16],[144,4,144,9],[144,11,144,16],[149,4,149,9],[149,11,149,16],[152,4,152,9],[152,11,152,16],[171,4,171,9],[171,11,171,16],[174,4,174,9],[174,11,174,16],[185,4,185,9],[185,11,185,16],[169,11,170,11],[169,12,170,12],[169,13,170,13],[169,14,170,14],[169,15,170,15],[169,16,170,16],[169,4,170,4],[169,5,170,5],[169,6,170,6],[169,7,170,7],[169,8,170,8],[169,9,170,9],[217,4,217,9],[217,11,217,16],[220,4,220,9],[220,11,220,16],[226,4,226,9],[226,11,226,16],[197,4,197,9],[197,11,197,16],[202,4,202,9],[202,11,202,16],[212,4,212,9],[212,11,212,16],[230,4,230,9],[230,11,230,16],[237,4,237,9],[237,11,237,16],[238,4,239,4],[238,5,239,5],[238,6,239,6],[238,7,239,7],[238,8,239,8],[238,9,239,9],[240,4,240,9],[240,11,240,16],[243,4,243,9],[243,11,243,16],[254,4,254,9],[254,11,254,16],[238,11,239,11],[238,12,239,12],[238,13,239,13],[238,14,239,14],[238,15,239,15],[238,16,239,16],[295,4,295,9],[295,11,295,16],[298,4,298,9],[298,11,298,16],[308,4,308,9],[308,11,308,16],[268,4,268,9],[268,11,268,16],[280,4,280,9],[280,11,280,16],[289,4,289,9],[289,11,289,16],[330,4,330,9],[330,11,330,16],[331,4,332,4],[331,5,332,5],[331,6,332,6],[331,7,332,7],[331,8,332,8],[331,9,332,9],[331,11,332,11],[331,12,332,12],[337,4,337,9],[337,11,337,16],[349,4,349,9],[349,11,349,16],[362,4,362,9],[362,11,362,16],[331,13,332,13],[331,14,332,14],[331,15,332,15],[331,16,332,16],[333,4,333,9],[333,11,333,16],[389,4,389,9],[389,11,389,16],[394,4,394,9],[394,11,394,16],[400,4,400,9],[400,11,400,16],[370,4,370,9],[370,11,370,16],[380,4,380,9],[380,11,380,16],[385,4,385,9],[385,11,385,16],[407,4,407,9],[407,11,407,16],[408,4,409,4],[408,5,409,5],[408,6,409,6],[408,7,409,7],[408,8,409,8],[408,9,409,9],[408,11,409,11],[408,12,409,12],[415,4,415,9],[415,11,415,16],[425,4,425,9],[425,11,425,16],[438,4,438,9],[438,11,438,16],[408,13,409,13],[408,14,409,14],[408,15,409,15],[408,16,409,16],[410,4,410,9],[410,11,410,16],[464,4,464,9],[464,11,464,16],[469,4,469,9],[469,11,469,16],[475,4,475,9],[475,11,475,16],[444,4,444,9],[444,11,444,16],[455,4,455,9],[455,11,455,16],[460,4,460,9],[460,11,460,16]]}
[]
[]
[null,null,null,null,"Project",null,null,null,null,null,null,null,null,null,null,null,null,"Projectcode:",null,"0447.005"]
[null,null,null,null,"Onderwerp"]
[null,null,null,null,"Opgesteld",null,null,null,null,null,null,null,null,null,null,null,null,"Versie:",null,"0.1"]
[null,null,null,null,"Gecontroleerd",null,null,null,null,null,null,null,null,null,null,null,null,"Versie datum:",null,"2022-04-25"]
[null,null,null,null,"Bestand:",null,null,null,null,null,null,null,null,null,null,null,null,"Status:",null,"concept"]
[]
[]
[null,null,null,null,"TRADITIONEEL BOUWEN",null,null,null,null,null,null,"CIRCULAIR BOUWEN"]
[]
[null,null,null,null,"GRONDGEBONDEN WONINGBOUW",null,null,null,null,null,null,"GRONDGEBONDEN WONINGBOUW"]
[]
[]
[]
[]
[]
[]
[]
[]
[]
[]
[]
[]
[]
[null,null,null,null,"Woning S tussen",null,null,null,null,null,null,"Woning S tussen"]
[null,null,null,null,"Element","Materialisatie","Hoeveelheid","Ehd","Ehd.prijs \n(directe bouwkosten)","Totale directe \nbouwkosten",null,"Element","Materialisatie","Hoeveelheid","Ehd","Ehd.prijs \n(directe bouwkosten)","Totale directe \nbouwkosten"]
[]
[null,null,null,null,"Fundering",null,null,null,null,null,null,"Fundering"]
[null,null,null,"FU02","Funderingsbalken, 400x500mm","In het werk gestort",19.399999999999999,"m1",{"$f":"VLOOKUP(D30,'Input Wonen'!$D$13:$H$151,4,FALSE)","v":{"$error":"#N/A"}},{"$f":"G30*I30","v":{"$error":"#N/A"}},null,"Funderingsbalken, 400x500mm","Beton met 30% recyclaat",19.399999999999999,"m1","Kosten opvragen",{"$f":"N30*P30","v":{"$error":"#VALUE!"}}]
[null,null,null,"FU04","Prefab funderingspaal, 350x350mm","Prefab beton",55.7,"m1",{"$f":"VLOOKUP(D31,'Input Wonen'!$D$13:$H$151,4,FALSE)","v":{"$error":"#N/A"}},{"$f":"G31*I31","v":{"$error":"#N/A"}},null,"Prefab funderingspaal, 350x350mm","Beton met 30% recyclaat",55.7,"m1","Kosten opvragen",{"$f":"N31*P31","v":{"$error":"#VALUE!"}}]
[null,null,null,null,"Vloeren",null,null,null,null,null,null,"Vloeren"]
[null,null,null,"VL01","Bodemafsluiting, 100 zand","Zand",48.6,"m2",{"$f":"VLOOKUP(D33,'Input Wonen'!$D$13:$H$151,4,FALSE)","v":{"$error":"#N/A"}},{"$error":"#N/A"},null,"Bodemafsluiting 100 zand","Zand",48.6,"m2",60,{"$f":"N33*P33","v":2916}]
[null,null,null,"VL02","Ribbenvloer incl. isolatie; Rc=4,0","Prefab beton",43.5,"m2",{"$f":"VLOOKUP(D34,'Input Wonen'!$D$13:$H$151,4,FALSE)","v":{"$error":"#N/A"}},{"$error":"#N/A"},null,"Kanaalplaatvloer incl. isolatie; Rc=4,0","Geïsoleerde groene kanaalplaatvloer - remontabel",43.5,"m2",75,3262.5]
[null,null,null,"VL03","Dekvloeren, 60mm","Zandcement dekvloer",41.5,"m2",{"$f":"VLOOKUP(D35,'Input Wonen'!$D$13:$H$151,4,FALSE)","v":{"$error":"#N/A"}},{"$error":"#N/A"},null,"Dekvloeren, 60mm","Zandcement dekvloer",41.5,"m2",12,498]
[null,null,null,"VL05","Vloertegelwerk toilet","Keramische tegels, geglazuurd/gelijmd",1,"m2",{"$f":"VLOOKUP(D36,'Input Wonen'!$D$13:$H$151,4,FALSE)","v":{"$error":"#N/A"}},{"$error":"#N/A"},null,"Vloertegelwerk toilet","Mosa C2C vloertegels",1,"m2",{"$f":"53.83*0.7*1.25","v":47.101249999999993},{"$f":"N36*P36","v":47.101249999999993}]
[null,null,null,"VL07","Vloerisolatie, Rc=3,5","EPS",43.5,"m2",{"$f":"VLOOKUP(D37,'Input Wonen'!$D$13:$H$151,4,FALSE)","v":{"$error":"#N/A"}},{"$error":"#N/A"},null,"Vloerisolatie, Rc=3,5","Pavaflex houtvezelisolatie",43.5,"m2",{"$f":"22.53*0.7*1.25","v":19.713749999999997},857.54812499999991]
[null,null,null,"VL08","Verdiepingsvloer, excl. druklaag 60mm","Breedplaatvloer, beton",81.099999999999994,"m2",{"$f":"VLOOKUP(D38,'Input Wonen'!$D$13:$H$151,4,FALSE)","v":{"$error":"#N/A"}},{"$error":"#N/A"},null,"Verdiepingsvloer","HSB vloerelement (balken + OSB), IsoVlas 60mm, gipsplaat (2x)",81.099999999999994,"m2",150,12165]
[null,null,null,"VL09","Druklaag, 190mm","Betonmortel",81.099999999999994,"m2",{"$f":"VLOOKUP(D39,'Input Wonen'!$D$13:$H$151,4,FALSE)","v":{"$error":"#N/A"}},{"$error":"#N/A"},null,"-","-","-","-",0,0]
[null,null,null,"VL10","Dekvloeren, 60mm","Zandcement dekvloer",75.8,"m2",{"$f":"VLOOKUP(D40,'Input Wonen'!$D$13:$H$151,4,FALSE)","v":{"$error":"#N/A"}},{"$error":"#N/A"},null,"Dekvloer","Fermacell honingraatvloer (op houten vloer)",75.8,"m2",{"$f":"(14.75+(2*6.9)+20.73)*0.7*1.25","v":43.11999999999999},{"$f":"N40*P40","v":3268.4959999999992}]
[null,null,null,"VL06","Vloertegelwerk badkamer","Keramische tegels, geglazuurd/gelijmd",5.7,"m2",{"$f":"VLOOKUP(D41,'Input Wonen'!$D$13:$H$151,4,FALSE)","v":{"$error":"#N/A"}},{"$error":"#N/A"},null,"Vloertegelwerk badkamer","Mosa C2C vloertegels",5.7,"m2",{"$f":"53.83*0.7*1.25","v":47.101249999999993},268.47712499999994]
[null,null,null,"VL11","Plafondafwerking","Spuitpleiser",75.8,"m2",{"$f":"VLOOKUP(D42,'Input Wonen'!$D$13:$H$151,4,FALSE)","v":{"$error":"#N/A"}},{"$error":"#N/A"},null,"Plafondafwerking","Spuitpleiser",75.8,"m2","-","-"]
[null,null,null,null,"Gevel",null,null,null,null,null,null,"Gevel"]
[null,null,null,"GE01","Gevelkozijnen; draaivalraam","Az. loofhout (Meranti), geschilderd",17.600000000000001,"m2",{"$f":"VLOOKUP(D44,'Input Wonen'!$D$13:$H$151,4,FALSE)","v":{"$error":"#N/A"}},{"$error":"#N/A"},null,"Gevelkozijnen; draaivalraam","Europees naaldhout, geschilderd",17.600000000000001,"m2",400,{"$f":"N44*P44","v":7040.0000000000009}]
[null,null,null,"GE02","Beglazing","Triple glas; droog beglaasd",13.61,"m2",{"$f":"VLOOKUP(D45,'Input Wonen'!$D$13:$H$151,4,FALSE)","v":{"$error":"#N/A"}},{"$error":"#N/A"},null,"Beglazing","Triple glas; droog beglaasd",13.61,"m2",110,1497.1]
[null,null,null,"GE03","Stelkozijnen","Onverduurzaamd hout, geverfd",7,"st",{"$f":"VLOOKUP(D46,'Input Wonen'!$D$13:$H$151,4,FALSE)","v":{"$error":"#N/A"}},{"$error":"#N/A"},null,"Stelkozijnen","Onverduurzaamd hout, geverfd",7,"st",25,175]
[null,null,null,"GE04","Vensterbanken","Composietsteen ",6.2,"m1",{"$f":"VLOOKUP(D47,'Input Wonen'!$D$13:$H$151,4,FALSE)","v":{"$error":"#N/A"}},{"$error":"#N/A"},null,"Vensterbanken","Vezelcement",6.2,"m1",{"$f":"71.7*0.7*1.25","v":62.737499999999997},388.97249999999997]
[null,null,null,"GE05","Waterslagen","Prefab beton",10.4,"m1",{"$f":"VLOOKUP(D48,'Input Wonen'!$D$13:$H$151,4,FALSE)","v":{"$error":"#N/A"}},{"$error":"#N/A"},null,"Waterslagen","Prefab beton",10.4,"m1",65,676]
[null,null,null,"GE06","Waterkeringen","EPDM-folie",10.4,"m1",{"$f":"VLOOKUP(D49,'Input Wonen'!$D$13:$H$151,4,FALSE)","v":{"$error":"#N/A"}},{"$error":"#N/A"},null,"Waterkeringen","EPDM-folie",10.4,"m1",15,156]
[null,null,null,"GE07","Lateivoorzieningen, L-ongelijkzijdig 50x30mm","Staal",12.6,"m1",{"$f":"VLOOKUP(D50,'Input Wonen'!$D$13:$H$151,4,FALSE)","v":{"$error":"#N/A"}},{"$error":"#N/A"},null,"Lateivoorzieningen, L-ongelijkzijdig 50x30mm","Staal",12.6,"m1",55,693]
[null,null,null,"GE08","Automatische zonwering (Raffstores)","Aluminium",15.2,"m2",{"$f":"VLOOKUP(D51,'Input Wonen'!$D$13:$H$151,4,FALSE)","v":{"$error":"#N/A"}},{"$error":"#N/A"},null,"Automatische zonwering (Raffstores)","Aluminium",15.2,"m2",null,0]
[null,null,null,"GE09","Stapeldorpel buitendeur","Trop. loofhout",2,"st",{"$f":"VLOOKUP(D52,'Input Wonen'!$D$13:$H$151,4,FALSE)","v":{"$error":"#N/A"}},{"$error":"#N/A"},null,"Stapeldorpel buitendeur","Europees naaldhout",2,"st",400,800]
[null,null,null,"GE10","Buitenspouwblad","Baksteenmetselwerk",50.5,"m2",{"$f":"VLOOKUP(D53,'Input Wonen'!$D$13:$H$151,4,FALSE)","v":{"$error":"#N/A"}},{"$error":"#N/A"},null,"Buitenspouwblad","Houten gevelbekleding",50.5,"m2",50,2525]
[null,null,null,"GE11","Spouwisolatie, Rc=4,5","PUR/PIR schuimplaten",47.9,"m2",{"$f":"VLOOKUP(D54,'Input Wonen'!$D$13:$H$151,4,FALSE)","v":{"$error":"#N/A"}},{"$error":"#N/A"}]
[null,null,null,"GE12","Binnenspouwblad, 100mm","Prefab beton",45.4,"m2",{"$f":"VLOOKUP(D55,'Input Wonen'!$D$13:$H$151,4,FALSE)","v":{"$error":"#N/A"}},{"$error":"#N/A"},null,"Binnenspouwblad, 100mm","HSB element, incl isolatie",45.4,"m2",180,8172]
[null,null,null,null,"Daken",null,null,null,null,null,null,"Daken"]
[null,null,null,"DA01","Dakconstructie, hellend; incl. isolatie en beplating","Prefab houten dakelement",70.599999999999994,"m2",{"$f":"VLOOKUP(D57,'Input Wonen'!$D$13:$H$151,4,FALSE)","v":{"$error":"#N/A"}},{"$error":"#N/A"},null,"Dakconstructie, hellend; incl. isolatie en beplating","HSB hellend dakelement incl. Isolatie",70.599999999999994,"m2",null,{"$f":"N57*P57","v":0}]
[null,null,null,"DA04","Isolatielagen; hellend dak; Rc=3,5","EPS",70.599999999999994,"m1",{"$f":"VLOOKUP(D58,'Input Wonen'!$D$13:$H$151,4,FALSE)","v":{"$error":"#N/A"}},{"$error":"#N/A"}]
[null,null,null,"DA06","Dakafwerking","Betonpan",70.599999999999994,"m1",{"$f":"VLOOKUP(D59,'Input Wonen'!$D$13:$H$151,4,FALSE)","v":{"$error":"#N/A"}},{"$error":"#N/A"},null,"Dakafwerking","Hergebruikte keramische pan",70.599999999999994,"m1",35,2471]
[null,null,null,"DA10","Dakraam","Meranti, geschilderd",1,"st",{"$f":"VLOOKUP(D60,'Input Wonen'!$D$13:$H$151,4,FALSE)","v":{"$error":"#N/A"}},{"$error":"#N/A"},null,"Dakraam","Meranti, geschilderd",1,"st",1000,1000]
[null,null,null,null,"Binnenwanden",null,null,null,null,null,null,"Binnenwanden"]
[null,null,null,"BI01","Binnenwanden, niet constructief","Prefab beton",140.69999999999999,"m2",{"$f":"VLOOKUP(D62,'Input Wonen'!$D$13:$H$151,4,FALSE)","v":{"$error":"#N/A"}},{"$error":"#N/A"},null,"Binnenwanden, niet constructief","HSB binnenwand element",140.69999999999999,"m2",120,{"$f":"N62*P62","v":16884}]
[null,null,null,"BI02","Wandtegelwerk badk/toilet/keuken","Keramische tegels; geglazuurd/gelijmd",23.9,"m2",{"$f":"VLOOKUP(D63,'Input Wonen'!$D$13:$H$151,4,FALSE)","v":{"$error":"#N/A"}},{"$error":"#N/A"},null,"Wandtegelwerk badk/toilet/keuken","Mosa C2C wandtegels",23.9,"m2",{"$f":"53.83*0.7*1.25","v":47.101249999999993},1125.7198749999998]
[null,null,null,"BI03","Gipskartonplaat systeemwand, 100 mm","Enkel beplaat zonder isolatie",10.199999999999999,"m2",{"$f":"VLOOKUP(D64,'Input Wonen'!$D$13:$H$151,4,FALSE)","v":{"$error":"#N/A"}},{"$error":"#N/A"},null,"Gipskartonplaat systeemwand, 100 mm","Faay biobased systeemwand [70mm]",10.199999999999999,"m2",42.54,433.90799999999996]
[null,null,null,"BI04","Gipsblokken, 70mm","Normale dichtheid",36.1,"m2",{"$f":"VLOOKUP(D65,'Input Wonen'!$D$13:$H$151,4,FALSE)","v":{"$error":"#N/A"}},{"$error":"#N/A"},null,"Gipsblokken, 70mm","HSB binnenwand element",36.1,"m2",120,4332]
[null,null,null,"BI05","Gipsblokken, 70mm","Hoge dichtheid",17.399999999999999,"m2",{"$f":"VLOOKUP(D66,'Input Wonen'!$D$13:$H$151,4,FALSE)","v":{"$error":"#N/A"}},{"$error":"#N/A"},null,"Gipsblokken, 70mm","HSB binnenwand element",17.399999999999999,"m2",120,2088]
[null,null,null,"BI06","Gipsblokken, 70mm","Hoge dichtheid",7.7,"m2",{"$f":"VLOOKUP(D67,'Input Wonen'!$D$13:$H$151,4,FALSE)","v":{"$error":"#N/A"}},{"$error":"#N/A"},null,"Gipsblokken, 70mm","HSB binnenwand element",7.7,"m2",120,924]
[null,null,null,"BI07","Vlakke houten binnendeur","Honingraat",8,"st",{"$f":"VLOOKUP(D68,'Input Wonen'!$D$13:$H$151,4,FALSE)","v":{"$error":"#N/A"}},{"$error":"#N/A"},null,"Vlakke houten binnendeur","Honingraat",8,"st",70,560]
[null,null,null,"BI08","Binnendorpels","Kunststeen",1.8,"m1",{"$f":"VLOOKUP(D69,'Input Wonen'!$D$13:$H$151,4,FALSE)","v":{"$error":"#N/A"}},{"$error":"#N/A"},null,"Binnendorpels","Kunststeen",1.8,"m1",32,57.6]
[null,null,null,"BI09","Binnenkozijn","Staal; verzinkt+gemoffeld",19.899999999999999,"m2",{"$f":"VLOOKUP(D70,'Input Wonen'!$D$13:$H$151,4,FALSE)","v":{"$error":"#N/A"}},{"$error":"#N/A"},null,"Binnenkozijn","Hout; geschilderd",19.899999999999999,"m2",null,0]
[null,null,null,null,"Klimaatinstallaties",null,null,null,null,null,null,"Klimaatinstallaties"]
[null,null,null,"KL01","Bodem warmtepomp","5 kW; incl. aardsondes",1,"st",{"$f":"VLOOKUP(D72,'Input Wonen'!$D$13:$H$151,4,FALSE)","v":{"$error":"#N/A"}},{"$error":"#N/A"},null,"Bodem warmtepomp","5 kW; incl. aardsondes",1,"st",10000,{"$f":"N72*P72","v":10000}]
[null,null,null,"KL02","Cv-leidingen","Incl. koppelingen en verdeler",110.1,"m2gbo",{"$f":"VLOOKUP(D73,'Input Wonen'!$D$13:$H$151,4,FALSE)","v":{"$error":"#N/A"}},{"$error":"#N/A"},null,"Cv-leidingen","Incl. koppelingen en verdeler",110.1,"m2gbo",null,0]
[null,null,null,"KL03","Vloerverwarming","95 W/m2",110.1,"m2gbo",{"$f":"VLOOKUP(D74,'Input Wonen'!$D$13:$H$151,4,FALSE)","v":{"$error":"#N/A"}},{"$error":"#N/A"},null,"Vloerverwarming","95 W/m2",110.1,"m2gbo",null,0]
[null,null,null,"KL04","VLA ventilatiesysteem","Type C; W-bouw, individueel",110.1,"m2gbo",{"$f":"VLOOKUP(D75,'Input Wonen'!$D$13:$H$151,4,FALSE)","v":{"$error":"#N/A"}},{"$error":"#N/A"},null,"VLA ventilatiesysteem","Type C; W-bouw, individueel",110.1,"m2gbo",null,0]
[null,null,null,null,"Elektrische installaties",null,null,null,null,null,null,"Elektrische installaties"]
[null,null,null,"EL01","Elektriciteitsleidingen","Geïsoleerde installatiedraad + mantelbuis",110.1,"m2gbo",{"$f":"VLOOKUP(D77,'Input Wonen'!$D$13:$H$151,4,FALSE)","v":{"$error":"#N/A"}},{"$error":"#N/A"},null,"Elektriciteitsleidingen","Geïsoleerde installatiedraad + mantelbuis",110.1,"m2gbo",null,{"$f":"N77*P77","v":0}]
[null,null,null,"EL02","Pv-panelen, hellend dak","Mono-Si; incl. inverter+kabels",4.5,"m2",{"$f":"VLOOKUP(D78,'Input Wonen'!$D$13:$H$151,4,FALSE)","v":{"$error":"#N/A"}},{"$error":"#N/A"},null,"Pv-panelen, hellend dak","PV CIS zonnepanelen",4.5,"m2",188,846]
[null,null,null,null,"Toe- en afvoeren",null,null,null,null,null,null,"Toe- en afvoeren"]
[null,null,null,"TO01","Waterleidingen","Polyetheen",110.1,"m2gbo",{"$f":"VLOOKUP(D80,'Input Wonen'!$D$13:$H$151,4,FALSE)","v":{"$error":"#N/A"}},{"$error":"#N/A"},null,"Waterleidingen","Polyetheen",110.1,"m2gbo",null,{"$f":"N80*P80","v":0}]
[null,null,null,"TO02","Buitenriolering","PVC",110.1,"m2gbo",{"$f":"VLOOKUP(D81,'Input Wonen'!$D$13:$H$151,4,FALSE)","v":{"$error":"#N/A"}},{"$error":"#N/A"},null,"Buitenriolering","PVC",110.1,"m2gbo",null,0]
[null,null,null,"TO03","Binnenriolering","PVC",110.1,"m2gbo",{"$f":"VLOOKUP(D82,'Input Wonen'!$D$13:$H$151,4,FALSE)","v":{"$error":"#N/A"}},{"$error":"#N/A"},null,"Binnenriolering","PVC",110.1,"m2gbo",null,0]
[null,null,null,"TO04","Hemelwaterafvoer","PVC",12,"m1",{"$f":"VLOOKUP(D83,'Input Wonen'!$D$13:$H$151,4,FALSE)","v":{"$error":"#N/A"}},{"$error":"#N/A"},null,"Hemelwaterafvoer","PVC",12,"m1",null,0]
[null,null,null,"TO05","Dakgoot","Aluminium",10.8,"m1",{"$f":"VLOOKUP(D84,'Input Wonen'!$D$13:$H$151,4,FALSE)","v":{"$error":"#N/A"}},{"$error":"#N/A"},null,"Dakgoot","Aluminium",10.8,"m1",65,702]
[null,null,null,null,"Verkeersruimte",null,null,null,null,null,null,"Verkeersruimte"]
[null,null,null,"VE01","Binnentrap","Eur. loofhout; geschilderd",2,"st",{"$f":"VLOOKUP(D86,'Input Wonen'!$D$13:$H$151,4,FALSE)","v":{"$error":"#N/A"}},{"$error":"#N/A"},null,"Binnentrap","Eur. loofhout; geschilderd",2,"st",2150,{"$f":"N86*P86","v":4300}]
[null,null,null,"VE02","Balustrades","Eur. loofhout; spijlen; duurzame bosbouw",5.0999999999999996,"m1",{"$f":"VLOOKUP(D87,'Input Wonen'!$D$13:$H$151,4,FALSE)","v":{"$error":"#N/A"}},{"$error":"#N/A"},null,"Balustrades","Eur. loofhout; spijlen; duurzame bosbouw",5.0999999999999996,"m1",125,637.5]
[null,null,null,"VE03","Leuningen","Eur. loofhout; duurzame bosbouw",10.4,"m1",{"$f":"VLOOKUP(D88,'Input Wonen'!$D$13:$H$151,4,FALSE)","v":{"$error":"#N/A"}},{"$error":"#N/A"},null,"Leuningen","Eur. loofhout; duurzame bosbouw",10.4,"m1",45,468]
[null,null,null,null,"Vaste voorzieningen",null,null,null,null,null,null,"Vaste voorzieningen"]
[null,null,null,"VA01","Toiletten; wandcloset + fontein","Porselein",2,"st",{"$f":"VLOOKUP(D90,'Input Wonen'!$D$13:$H$151,4,FALSE)","v":{"$error":"#N/A"}},{"$error":"#N/A"},null,"Toiletten; wandcloset + fontein","Porselein",2,"st",450,{"$f":"N90*P90","v":900}]
[null,null,null,"VA02","Wastafel","Keramisch",2,"st",{"$f":"VLOOKUP(D91,'Input Wonen'!$D$13:$H$151,4,FALSE)","v":{"$error":"#N/A"}},{"$error":"#N/A"},null,"Wastafel","Keramisch",2,"st",null,0]
[null,null,null,"VA03","Inloopdouche","Gipsblokken + tegels incl. rvs afvoergoot",1,"st",{"$f":"VLOOKUP(D92,'Input Wonen'!$D$13:$H$151,4,FALSE)","v":{"$error":"#N/A"}},{"$error":"#N/A"},null,"Inloopdouche","Gipsblokken + tegels incl. rvs afvoergoot",1,"st",null,0]
[]
[null,null,null,null,null,null,null,null,null,{"$f":"SUMPRODUCT(J30:J93)","v":{"$error":"#N/A"}},null,null,null,null,null,null,{"$f":"SUMPRODUCT(Q30:Q93)","v":{"$error":"#VALUE!"}}]
[]
[null,null,null,null,"Woning M tussen",null,null,null,null,null,null,"Woning M tussen"]
[null,null,null,null,"Element","Materialisatie","Hoeveelheid","Ehd","Ehd.prijs \n(directe bouwkosten)","Totale directe \nbouwkosten",null,"Element","Materialisatie","Hoeveelheid","Ehd","Ehd.prijs \n(directe bouwkosten)","Totale directe \nbouwkosten"]
[]
[null,null,null,null,"Fundering",null,null,null,null,null,null,"Fundering"]
[null,null,null,"FU02","Funderingsbalken, 400x500mm","in het werk gestort",24,"m1",{"$f":"VLOOKUP(D100,'Input Wonen'!$D$13:$H$151,4,FALSE)","v":{"$error":"#N/A"}},{"$f":"G100*I100","v":{"$error":"#N/A"}},null,"Betonhuis; in het werk gestort","Beton met 30% recyclaat",24,"m1","Kosten opvragen",{"$f":"N100*P100","v":{"$error":"#VALUE!"}}]
[null,null,null,"FU04","Prefab funderingspaal, 350x350mm","Prefab beton",69.92,"m1",null,{"$f":"G101*I101","v":0},null,"Prefab heipaal","Beton met 30% recyclaat",69.92,"m1","Kosten opvragen",{"$f":"N101*P101","v":{"$error":"#VALUE!"}}]
[null,null,null,null,"Vloeren",null,null,null,null,0,null,"Vloeren"]
[null,null,null,"VL01","Bodemafsluiting, zand",null,70,"m2",null,0,null,"Bodemafsluiting, zand",null,70,"m2"]
[null,null,null,"VL02","Prefab ribbenvloer incl. isolatie; Rc=4,0",null,63.5,"m2",null,0,null,"Prefab ribbenvloer incl. isolatie; Rc=4,0","Geïsoleerde groene kanaalplaatvloer - remontabel",63.5,"m2",75,{"$f":"N104*P104","v":4762.5}]
[null,null,null,"VL03","Zandcement dekvloer",null,60.3,"m2",null,0,null,"Zandcement dekvloer",null,60.3,"m2"]
[null,null,null,"VL05","Keramische tegels; geglazuurd/cement",null,1,"m2",null,0,null,"Keramische tegels; geglazuurd/cement","Mosa C2C vloertegels",1,"m2",{"$f":"53.83*0.7*1.25","v":47.101249999999993},{"$f":"N106*P106","v":47.101249999999993}]
[null,null,null,"VL08","Breedplaatvloer",null,26.1,"m2",null,0,null,"Breedplaatvloer","HSB vloerelement (balken + OSB), IsoVlas 60mm, gipsplaat (2x)",26.1,"m2"]
[null,null,null,"VL09","Druklaag",null,26.1,"m2",null,0,null,"-","-","-","-","-","-"]
[null,null,null,"VL10","Zandcement dekvloer",null,23.9,"m2",null,0,null,"Zandcement dekvloer","Fermacell honingraatvloer (op houten vloer)",23.9,"m2",{"$f":"(14.75+(2*6.9)+20.73)*0.7*1.25","v":43.11999999999999},{"$f":"N109*P109","v":1030.5679999999998}]
[null,null,null,"VL06","Keramische tegels",null,4.5999999999999996,"m2",null,0,null,"Keramische tegels","Mosa C2C vloertegels",4.5999999999999996,"m2",{"$f":"53.83*0.7*1.25","v":47.101249999999993},{"$f":"N110*P110","v":216.66574999999995}]
[null,null,null,"VL11","Spuitpleister",null,23.9,"m2",null,0,null,"Spuitpleister",null,23.9,"m2","-","-"]
[null,null,null,null,"Draagconstructie",null,null,null,null,0,null,"Draagconstructie"]
[null,null,null,"DR01","Stalen balk","INP80 profiel",38,"m1",null,0,null,"Stalen balk","INP80 profiel",38,"m1"]
[null,null,null,null,"Gevel",null,null,null,null,0,null,"Gevel"]
[null,null,null,"GE10","Baksteenmetselwerk",null,75.3,"m2",null,{"$f":"G115*I115","v":0},null,"Baksteenmetselwerk","Houten gevelbekleding",75.3,"m2",50,{"$f":"N115*P115","v":3765}]
[null,null,null,"GE12","Prefab beton binnenblad; 100mm",null,67.8,"m2",null,{"$f":"G116*I116","v":0},null,"Prefab beton binnenblad; 100mm","HSB element",67.8,"m2",180,12204]
[null,null,null,"GE11","PUR/PIR schuimplaten isolatie; Rc=4,5",null,71.5,"m2",null,{"$f":"G117*I117","v":0}]
[null,null,null,"GE01","Houten buitenkozijnen; draaivalraam, geschilderd",null,19.899999999999999,"m2",null,0,null,"Houten buitenkozijnen; draaivalraam, geschilderd","Europees naaldhout",19.899999999999999,"m2"]
[null,null,null,"GE02","Triple glas",null,15.8,"m2",null,0,null,"Triple glas",null,15.8,"m2"]
[null,null,null,"GE03","Houten stelkozijnen, geschilderd",null,9,"st",null,0,null,"Houten stelkozijnen, geschilderd",null,9,"st"]
[null,null,null,"GE04","Composietsteen vensterbanken",null,6.2,"m1",null,0,null,"Composietsteen vensterbanken","Vezelcement",6.2,"m1",{"$f":"71.7*0.7*1.25","v":62.737499999999997},{"$f":"N121*P121","v":388.97249999999997}]
[null,null,null,"GE05","Betonnen waterslagen",null,11.1,"m1",null,0,null,"Betonnen waterslagen",null,11.1,"m1"]
[null,null,null,"GE06","Waterkering; EPDM folie",null,11.1,"m1",null,0,null,"Waterkering; EPDM folie",null,11.1,"m1"]
[null,null,null,"GE07","Stalen lateien; L-ongelijkzijdig",null,11.1,"m1",null,0,null,"Stalen lateien; L-ongelijkzijdig",null,11.1,"m1"]
[null,null,null,"GE08","Automatische zonwering (Raffstores)",null,16.7,"m2",null,0,null,"Automatische zonwering (Raffstores)",null,16.7,"m2"]
[null,null,null,"GE09","Houten stapeldorpel buitendeur",null,3,"st",null,0,null,"Houten stapeldorpel buitendeur",null,3,"st"]
[null,null,null,null,"Daken",null,null,null,null,0,null,"Daken"]
[null,null,null,"DA02","Breedplaatvloer; 60mm",null,63.5,"m2",null,0,null,"Breedplaatvloer; 60mm","HSB plat dakelement + gipsplaat excl. Isolatie",63.5,"m2","Kosten opvragen"]
[null,null,null,"DA03","Druklaag; betonmortel",null,63.5,"m2",null,0,null,"-","-","-","-","-","-"]
[null,null,null,"DA05","XPS isolatie; hellend dak; Rc=3,5",null,63.5,"m2",null,0,null,"Isolatielagen; hellend dak; Rc=6,3","Isovlas [220mm dik]"]
[null,null,null,"DA07","Grind",null,63.5,"m2",null,0,null,"Grind",null,63.5,"m2"]
[null,null,null,"DA08","Dakbedekking; bitumen",null,63.5,"m2",null,0,null,"Dakbedekking; bitumen","EPDM Hertalan EASY COVER (Rhinobond)",63.5,"m2","Kosten opvragen"]
[null,null,null,"DA12","Spuitpleister",null,63.5,"m2",null,0,null,"-","-","-","-","-"]
[null,null,null,"DA12","Spuitpleister",null,63.5,"m2",null,0,null,"-","-","-","-"]
[null,null,null,"DA11","Waterkering; EPDM aluminium versterkt",null,1,"m1",null,0,null,"Waterkering; EPDM aluminium versterkt",null,1,"m1"]
[null,null,null,null,"Binnenwanden",null,null,null,null,0,null,"Binnenwanden"]
[null,null,null,"BI01","Prefab beton, niet-dragende binnenwand",null,77.7,"m2",null,0,null,"Prefab beton, niet-dragende binnenwand","HSB binnenwand element",77.7,"m2",120,{"$f":"N137*P137","v":9324}]
[null,null,null,"BI02","Keramische tegels; geglazuurd/gelijmd",null,19.8,"m2",null,0,null,"Keramische tegels; geglazuurd/gelijmd","Mosa C2C wandtegels",19.8,null,{"$f":"53.83*0.7*1.25","v":47.101249999999993},932.60474999999985]
[null,null,null,"BI04","Gipsblokken, normale dichtheid, 70mm",null,29.9,"m2",null,0,null,"Gipsblokken, normale dichtheid, 70mm","HSB binnenwand element",29.9,"m2",120,3588]
[null,null,null,"BI05","Gipsblokken, hoge dichtheid, 70mm",null,13.9,"m2",null,0,null,"Gipsblokken, hoge dichtheid, 70mm","HSB binnenwand element",13.9,"m2",120,{"$f":"N140*P140","v":1668}]
[null,null,null,"BI06","Gipsblokken, hoge dichtheid, 70mm",null,6.2,"m2",null,0,null,"Gipsblokken, hoge dichtheid, 70mm","HSB binnenwand element",6.2,"m2",120,{"$f":"N141*P141","v":744}]
[null,null,null,"BI07","Vlakke houten vlakke binnendeur; honingraat",null,6,"st",null,0,null,"Vlakke houten vlakke binnendeur; honingraat",null,6,"st"]
[null,null,null,"BI08","Kunststeen binnendorpels",null,1.8,"m1",null,0,null,"Kunststeen binnendorpels",null,1.8,"m1"]
[null,null,null,"BI09","Stalen binnenkozijn",null,14.8,"m2",null,0,null,"Stalen binnenkozijn",null,14.8,"m2"]
[null,null,null,null,"Klimaatinstallaties",null,null,null,null,0,null,"Klimaatinstallaties"]
[null,null,null,null,"Bodem warmtepomp",null,1,"st",null,0,null,"Bodem warmtepomp",null,1,"st"]
[null,null,null,null,"Cv-leidingen",null,81.7,"m2gbo",null,0,null,"Cv-leidingen",null,81.7,"m2gbo"]
[null,null,null,null,"Vloerverwarming",null,81.7,"m2gbo",null,0,null,"Vloerverwarming",null,81.7,"m2gbo"]
[null,null,null,null,"VLA ventilatiesysteem",null,81.7,"m2gbo",null,0,null,"VLA ventilatiesysteem",null,81.7,"m2gbo"]
[null,null,null,null,"Elektrische installaties",null,null,null,null,0,null,"Elektrische installaties"]
[null,null,null,null,"Geïsoleerde installatiedraad en mantelbuis",null,87.1,"m2gbo",null,0,null,"Geïsoleerde installatiedraad en mantelbuis",null,87.1,"m2gbo"]
[null,null,null,null,"Pv-panelen",null,7.5,"m2",188,1410,null,"Pv-panelen","PV CIS zonnepanelen",7.5,"m2",null,188]
[null,null,null,null,"Toe- en afvoeren",null,null,null,null,0,null,"Toe- en afvoeren"]
[null,null,null,null,"Waterleidingen",null,87.1,"m2gbo",null,0,null,"Waterleidingen",null,87.1,"m2gbo"]
[null,null,null,null,"Buitenriolering; pvc",null,87.1,"m2gbo",null,0,null,"Buitenriolering; pvc",null,87.1,"m2gbo"]
[null,null,null,null,"Binnenriolering; pvc",null,87.1,"m2gbo",null,0,null,"Binnenriolering; pvc",null,87.1,"m2gbo"]
[null,null,null,null,"Hemelwaterafvoer; pvc",null,12.6,"m1",null,0,null,"Hemelwaterafvoer; pvc",null,12.6,"m1"]
[null,null,null,null,"Verkeersruimte",null,null,null,null,0,null,"Verkeersruimte"]
[null,null,null,null,"Houten trap",null,1,"st",null,0,null,"Houten trap",null,1,"st"]
[null,null,null,null,"Houten balustrades",null,4.3,"m1",null,0,null,"Houten balustrades",null,4.3,"m1"]
[null,null,null,null,"Houten leuningen",null,5.2,"m1",null,0,null,"Houten leuningen",null,5.2,"m1"]
[null,null,null,null,"Vaste voorzieningen",null,null,null,null,0,null,"Vaste voorzieningen"]
[null,null,null,null,"Toiletten; wandcloset + fontein",null,2,"st",null,0,null,"Toiletten; wandcloset + fontein",null,2,"st"]
[null,null,null,null,"Keramische wastafel",null,2,"st",null,0,null,"Keramische wastafel",null,2,"st"]
[null,null,null,null,"Inloopdouche",null,1,"st",null,0,null,"Inloopdouche",null,1,"st"]
[]
[]
[]
[null,null,null,null,"Woning M hoek",null,null,null,null,null,null,"Woning M hoek"]
[null,null,null,null,"Element","Materialisatie","Hoeveelheid","Ehd","Ehd.prijs \n(directe bouwkosten)","Totale directe \nbouwkosten",null,"Element","Materialisatie","Hoeveelheid","Ehd","Ehd.prijs \n(directe bouwkosten)","Totale directe \nbouwkosten"]
[]
[null,null,null,null,"Fundering",null,null,null,null,null,null,"Fundering"]
[null,null,null,"FU02","Betonhuis; in het werk gestort",null,27.2,"m1",null,{"$f":"G173*I173","v":0},null,"Betonhuis; in het werk gestort","Beton met 30% recyclaat",27.2,"m1",null,{"$f":"N173*P173","v":0}]
[null,null,null,"FU04","Prefab heipaal",null,78.099999999999994,"m1",null,{"$f":"G174*I174","v":0},null,"Prefab heipaal","Beton met 30% recyclaat",78.099999999999994,"m1",null,{"$f":"N174*P174","v":0}]
[null,null,null,null,"Vloeren",null,null,null,null,0,null,"Vloeren",null,null,null,null,0]
[null,null,null,"VL01","Bodemafsluiting, zand",null,59.99,"m2",null,0,null,"Bodemafsluiting, zand",null,59.99,"m2",null,0]
[null,null,null,"VL02","Prefab ribbenvloer incl. isolatie; Rc=4,0",null,47.5,"m2",null,0,null,"Prefab ribbenvloer incl. isolatie; Rc=4,0","Geïsoleerde groene kanaalplaatvloer - remontabel",47.5,"m2",75,3562.5]
[null,null,null,"VL03","Zandcement dekvloer",null,48.7,"m2",null,0,null,"Zandcement dekvloer",null,48.7,"m2",null,0]
[null,null,null,"VL05","Keramische tegels; geglazuurd/cement",null,1,"m2",null,0,null,"Keramische tegels; geglazuurd/cement","Mosa C2C vloertegels",1,"m2",{"$f":"53.83*0.7*1.25","v":47.101249999999993},{"$f":"N179*P179","v":47.101249999999993}]
[null,null,null,"VL07","EPS isolatie; Rc=3,5",null,47.5,"m2",null,0,null,"EPS isolatie; Rc=3,5","Pavaflex houtvezelisolatie",47.5,"m2",{"$f":"22.53*0.7*1.25","v":19.713749999999997},936.40312499999993]
[null,null,null,"VL08","Breedplaatvloer",null,89.3,"m2",null,0,null,"Breedplaatvloer","HSB vloerelement (balken + OSB), IsoVlas 60mm, gipsplaat (2x)",89.3,"m2",null,0]
[null,null,null,"VL09","Druklaag",null,89.3,"m2",null,0,null,"Druklaag",null,89.3,"m2",null,0]
[null,null,null,"VL10","Zandcement dekvloer",null,90.2,"m2",null,0,null,"Zandcement dekvloer","Fermacell honingraatvloer (op houten vloer)",90.2,"m2",{"$f":"(14.75+(2*6.9)+20.73)*0.7*1.25","v":43.11999999999999},{"$f":"N183*P183","v":3889.4239999999991}]
[null,null,null,"VL06","Keramische tegels",null,6.8,"m2",null,0,null,"Keramische tegels","Mosa C2C vloertegels",6.8,"m2",{"$f":"53.83*0.7*1.25","v":47.101249999999993},320.28849999999994]
[null,null,null,"VL11","Spuitpleister",null,90.2,"m2",null,0,null,"Spuitpleister",null,90.2,"m2","-","-"]
[null,null,null,null,"Gevel",null,null,null,null,0,null,"Gevel",null,null,null,null,0]
[null,null,null,"GE10","Baksteenmetselwerk",null,145,"m2",null,{"$f":"G187*I187","v":0},null,"Baksteenmetselwerk","Houten gevelbekleding",145,"m2",50,7250]
[null,null,null,"GE12","Prefab beton binnenblad; 100mm",null,130.5,"m2",null,{"$f":"G188*I188","v":0},null,"Prefab beton binnenblad; 100mm","HSB element",130.5,"m2",180,23490]
[null,null,null,"GE11","PUR/PIR schuimplaten isolatie; Rc=4,5",null,137.80000000000001,"m2",null,{"$f":"G189*I189","v":0},null,null,null,null,null,null,{"$f":"N189*P189","v":0}]
[null,null,null,"GE01","Houten buitenkozijnen; draaivalraam, geschilderd",null,31,"m2",null,{"$f":"G190*I190","v":0},null,"Houten buitenkozijnen; draaivalraam, geschilderd","Europees naaldhout",31,"m2",null,{"$f":"N190*P190","v":0}]
[null,null,null,"GE02","Triple glas",null,25.8,"m2",null,0,null,"Triple glas",null,25.8,"m2",null,0]
[null,null,null,"GE03","Houten stelkozijnen, geschilderd",null,12,"st",null,0,null,"Houten stelkozijnen, geschilderd",null,12,"st",null,0]
[null,null,null,"GE04","Composietsteen vensterbanken",null,9.1999999999999993,"m1",null,0,null,"Composietsteen vensterbanken","Vezelcement",9.1999999999999993,"m1",{"$f":"71.7*0.7*1.25","v":62.737499999999997},577.18499999999995]
[null,null,null,"GE05","Betonnen waterslagen",null,16.8,"m1",null,0,null,"Betonnen waterslagen",null,16.8,"m1",null,0]
[null,null,null,"GE07","Stalen lateien; L-ongelijkzijdig",null,16.8,"m1",null,0,null,"Stalen lateien; L-ongelijkzijdig",null,16.8,"m1",null,0]
[null,null,null,"GE08","Automatische zonwering (Raffstores)",null,16.8,"m2",null,0,null,"Automatische zonwering (Raffstores)",null,16.8,"m2",null,0]
[null,null,null,"GE09","Houten stapeldorpel buitendeur",null,3,"st",null,0,null,"Houten stapeldorpel buitendeur",null,3,"st",null,0]
[null,null,null,null,"Daken",null,null,null,null,0,null,"Daken",null,null,null,null,0]
[null,null,null,"DA01","Prefab houten dakelement, incl. isolatie en beplating",null,86.8,"m2",null,0,null,"Prefab houten dakelement, incl. isolatie en beplating","HSB hellend dakelement incl. Isolatie",86.8,"m2",null,0]
[null,null,null,null,"EPS isolatie; hellend dak; Rc=3,5",null,86.8,"m2",null,0]
[null,null,null,null,"Dakbedekking, betonpan",null,86.8,"m2",null,0,null,"Dakbedekking, betonpan","Hergebruikte keramische pan",86.8,"m2",35,3038]
[null,null,null,null,"Bekledingen en roosters verlaagde plafonds, spaanplaat (incl. regelwerk)",null,70.7,"m2",null,0,null,"Bekledingen en roosters verlaagde plafonds, spaanplaat (incl. regelwerk)",null,70.7,"m2",null,0]
[null,null,null,null,"Binnenwanden",null,null,null,null,0,null,"Binnenwanden",null,null,null,null,0]
[null,null,null,null,"Prefab beton, niet-dragende binnenwand",null,76.400000000000006,"m2",null,0,null,"Prefab beton, niet-dragende binnenwand","HSB binnenwand element",76.400000000000006,"m2",120,9168]
[null,null,null,null,"Keramische tegels; geglazuurd/gelijmd",null,28,"m2",null,0,null,"Keramische tegels; geglazuurd/gelijmd","Mosa C2C wandtegels",28,"m2",{"$f":"53.83*0.7*1.25","v":47.101249999999993},1318.8349999999998]
[null,null,null,null,"Gipskartonplaat systeemwand; enkel beplaat zonder isolatie",null,11.1,"m2",null,0,null,"Gipskartonplaat systeemwand; enkel beplaat zonder isolatie","Faay biobased systeemwand",11.1,"m2",42.54,472.19399999999996]
[null,null,null,null,"Gipsblokken, normale dichtheid, 70mm",null,42.3,"m2",null,0,null,"Gipsblokken, normale dichtheid, 70mm","HSB binnenwand element",42.3,"m2",120,5076]
[null,null,null,null,"Gipsblokken, hoge dichtheid, 70mm",null,20.8,"m2",null,0,null,"Gipsblokken, hoge dichtheid, 70mm","HSB binnenwand element",20.8,"m2",120,{"$f":"N208*P208","v":2496}]
[null,null,null,null,"Gipsblokken, hoge dichtheid, 70mm",null,9.3000000000000007,"m2",null,0,null,"Gipsblokken, hoge dichtheid, 70mm","HSB binnenwand element",9.3000000000000007,"m2",120,{"$f":"N209*P209","v":1116}]
[null,null,null,null,"Vlakke houten vlakke binnendeur; honingraat",null,10,"st",null,0,null,"Vlakke houten vlakke binnendeur; honingraat",null,10,"st",null,0]
[null,null,null,null,"Kunststeen binnendorpels",null,1.8,"m1",null,0,null,"Kunststeen binnendorpels",null,1.8,"m1",null,0]
[null,null,null,null,"Stalen binnenkozijn",null,24.9,"m2",null,0,null,"Stalen binnenkozijn",null,24.9,"m2",null,0]
[null,null,null,null,"Klimaatinstallaties",null,null,null,null,0,null,"Klimaatinstallaties",null,null,null,null,0]
[null,null,null,null,"Bodem warmtepomp",null,1,"st",null,0,null,"Bodem warmtepomp",null,1,"st",null,0]
[null,null,null,null,"Cv-leidingen",null,133.30000000000001,"m2gbo",null,0,null,"Cv-leidingen",null,133.30000000000001,"m2gbo",null,0]
[null,null,null,null,"Vloerverwarming",null,133.30000000000001,"m2gbo",null,0,null,"Vloerverwarming",null,133.30000000000001,"m2gbo",null,0]
[null,null,null,null,"VLA ventilatiesysteem",null,133.30000000000001,"m2gbo",null,0,null,"VLA ventilatiesysteem",null,133.30000000000001,"m2gbo",null,0]
[null,null,null,null,"Elektrische installaties",null,null,null,null,0,null,"Elektrische installaties",null,null,null,null,0]
[null,null,null,null,"Geïsoleerde installatiedraad en mantelbuis",null,133.30000000000001,"m2gbo",null,0,null,"Geïsoleerde installatiedraad en mantelbuis",null,133.30000000000001,"m2gbo",null,0]
[null,null,null,null,"Pv-panelen",null,5,"m2",188,940,null,"Pv-panelen","PV CIS zonnepanelen",5,"m2",188,940]
[null,null,null,null,"Toe- en afvoeren",null,null,null,null,0,null,"Toe- en afvoeren",null,null,null,null,0]
[null,null,null,null,"Waterleidingen",null,133.30000000000001,"m2gbo",null,0,null,"Waterleidingen",null,133.30000000000001,"m2gbo",null,0]
[null,null,null,null,"Buitenriolering; pvc",null,133.30000000000001,"m2gbo",null,0,null,"Buitenriolering; pvc",null,133.30000000000001,"m2gbo",null,0]
[null,null,null,null,"Binnenriolering; pvc",null,133.30000000000001,"m2gbo",null,0,null,"Binnenriolering; pvc",null,133.30000000000001,"m2gbo",null,0]
[null,null,null,null,"Aluminium dakgoten",null,5.7,"m1",null,0,null,"Aluminium dakgoten",null,5.7,"m1",null,0]
[null,null,null,null,"Hemelwaterafvoer; pvc",null,18,"m1",null,0,null,"Hemelwaterafvoer; pvc",null,18,"m1",null,0]
[null,null,null,null,"Verkeersruimte",null,null,null,null,0,null,"Verkeersruimte",null,null,null,null,0]
[null,null,null,null,"Houten trap",null,2,"st",null,0,null,"Houten trap",null,2,"st",null,0]
[null,null,null,null,"Houten trap",null,10.4,"st",null,0,null,"Houten trap",null,10.4,"st",null,0]
[null,null,null,null,"Houten balustrades",null,5.0999999999999996,"m1",null,0,null,"Houten balustrades",null,5.0999999999999996,"m1",null,0]
[null,null,null,null,"Vaste voorzieningen",null,null,null,null,0,null,"Vaste voorzieningen",null,null,null,null,0]
[null,null,null,null,"Toiletten; wandcloset + fontein",null,2,"st",null,0,null,"Toiletten; wandcloset + fontein",null,2,"st",null,0]
[null,null,null,null,"Keramische wastafel",null,2,"st",null,0,null,"Keramische wastafel",null,2,"st",null,0]
[null,null,null,null,"Inloopdouche",null,1,"st",null,0,null,"Inloopdouche",null,1,"st",null,0]
[]
[]
[]
[null,null,null,null,"Woning L vrij",null,null,null,null,null,null,"Woning L vrij"]
[null,null,null,null,"Element","Materialisatie","Hoeveelheid","Ehd","Ehd.prijs \n(directe bouwkosten)","Totale directe \nbouwkosten",null,"Element","Materialisatie","Hoeveelheid","Ehd","Ehd.prijs \n(directe bouwkosten)","Totale directe \nbouwkosten"]
[]
[null,null,null,null,"Fundering",null,null,null,null,null,null,"Fundering"]
[null,null,null,"FU02","Betonhuis; in het werk gestort",null,38,"m1",null,{"$f":"G242*I242","v":0},null,"Betonhuis; in het werk gestort","Beton met 30% recyclaat",38,"m1"]
[null,null,null,"FU04","Prefab heipaal",null,109.1,"m1",null,{"$f":"G243*I243","v":0},null,"Prefab heipaal","Beton met 30% recyclaat",109.1,"m1"]
[null,null,null,null,"Vloeren",null,null,null,null,0,null,"Vloeren"]
[null,null,null,"VL01","Bodemafsluiting, zand",null,88,"m2",null,0,null,"Bodemafsluiting, zand",null,88,"m2"]
[null,null,null,"VL02","Prefab ribbenvloer incl. isolatie; Rc=4,0",null,75.5,"m2",null,0,null,"Prefab ribbenvloer incl. isolatie; Rc=4,0","Geïsoleerde groene kanaalplaatvloer - remontabel",75.5,"m2",75,{"$f":"N246*P246","v":5662.5}]
[null,null,null,"VL03","Zandcement dekvloer",null,71.3,"m2",null,0,null,"Zandcement dekvloer",null,71.3,"m2"]
[null,null,null,"VL05","Keramische tegels; geglazuurd/cement",null,1,"m2",null,0,null,"Keramische tegels; geglazuurd/cement","Mosa C2C vloertegels",1,"m2",{"$f":"53.83*0.7*1.25","v":47.101249999999993},{"$f":"N248*P248","v":47.101249999999993}]
[null,null,null,"VL07","EPS isolatie; Rc=3,5",null,45.5,"m2",null,0,null,"EPS isolatie; Rc=3,5","Pavaflex houtvezelisolatie",45.5,"m2",{"$f":"22.53*0.7*1.25","v":19.713749999999997},{"$f":"N249*P249","v":896.97562499999992}]
[null,null,null,"VL08","Breedplaatvloer",null,145.19999999999999,"m2",null,0,null,"Breedplaatvloer","HSB vloerelement (balken + OSB), IsoVlas 60mm, gipsplaat (2x)",145.19999999999999,"m2"]
[null,null,null,"VL09","Druklaag",null,145.19999999999999,"m2",null,0,null,"-","-",145.19999999999999,"m2","-","-"]
[null,null,null,"VL10","Zandcement dekvloer",null,126.2,"m2",null,0,null,"Zandcement dekvloer","Fermacell honingraatvloer (op houten vloer)",126.2,"m2",{"$f":"(14.75+(2*6.9)+20.73)*0.7*1.25","v":43.11999999999999},{"$f":"N252*P252","v":5441.7439999999988}]
[null,null,null,"VL06","Keramische tegels",null,9.4,"m2",null,0,null,"Keramische tegels","Mosa C2C vloertegels",9.4,"m2",{"$f":"53.83*0.7*1.25","v":47.101249999999993},{"$f":"N253*P253","v":442.75174999999996}]
[null,null,null,"VL11","Spuitpleister",null,126.2,"m2",null,0,null,"Spuitpleister",null,126.2,"m2",null,"-"]
[null,null,null,null,"Gevel",null,null,null,null,0,null,"Gevel"]
[null,null,null,"GE10","Baksteenmetselwerk",null,220.7,"m2",null,{"$f":"G256*I256","v":0},null,"Baksteenmetselwerk","Houten gevelbekleding",220.7,"m2",50,{"$f":"N256*P256","v":11035}]
[null,null,null,"GE12","Prefab beton binnenblad; 100mm",null,198.6,"m2",null,{"$f":"G257*I257","v":0},null,"Prefab beton binnenblad; 100mm","HSB element incl. isolatie",198.6,"m2",180,35748]
[null,null,null,"GE13","Prefab HSB systeemwand buitenwandelement",null,11.9,"m2",null,{"$f":"G258*I258","v":0},null,"Prefab HSB systeemwand buitenwandelement",null,11.9,"m2"]
[null,null,null,"GE11","PUR/PIR schuimplaten isolatie; Rc=4,5",null,209.6,"m2",null,{"$f":"G259*I259","v":0}]
[null,null,null,"GE01","Houten buitenkozijnen; draaivalraam, geschilderd",null,56.6,"m2",null,{"$f":"G260*I260","v":0},null,"Houten buitenkozijnen; draaivalraam, geschilderd","Europees naaldhout",56.6,"m2"]
[null,null,null,"GE02","Triple glas",null,49,"m2",null,0,null,"Triple glas",null,49,"m2"]
[null,null,null,"GE03","Houten stelkozijnen, geschilderd",null,22,"st",null,0,null,"Houten stelkozijnen, geschilderd",null,22,"st"]
[null,null,null,"GE05","Composietsteen vensterbanken",null,20,"m1",null,0,null,"Composietsteen vensterbanken","Vezelcement",20,"m1",{"$f":"71.7*0.7*1.25","v":62.737499999999997},{"$f":"N263*P263","v":1254.75}]
[null,null,null,"GE07","Betonnen waterslagen",null,29.8,"m1",null,0,null,"Betonnen waterslagen",null,29.8,"m1"]
[null,null,null,"GE08","Waterkering, EPDM; folie",null,31.8,"m1",null,0,null,"Waterkering, EPDM; folie",null,31.8,"m1"]
[null,null,null,"GE09","Stalen lateien; L-ongelijkzijdig",null,29.8,"m1",null,0,null,"Stalen lateien; L-ongelijkzijdig",null,29.8,"m1"]
[null,null,null,"GE08","Automatische zonwering (Raffstores)",null,51.8,"m2",null,0,null,"Automatische zonwering (Raffstores)",null,51.8,"m2"]
[null,null,null,"GE09","Houten stapeldorpel buitendeur",null,5,"st",null,0,null,"Houten stapeldorpel buitendeur",null,5,"st"]
[null,null,null,null,"Daken",null,null,null,null,0,null,"Daken"]
[null,null,null,null,"Prefab houten dakelement, incl. isolatie en beplating; platdak",null,8.1,"m2",null,0,null,"Prefab houten dakelement, incl. isolatie en beplating; platdak","HSB plat dakelement + gipsplaat excl. Isolatie",8.1,"m2"]
[null,null,null,null,"XPS isolatie; platdak; Rc=3,5",null,8.1,"m2",null,0,null,"Isolatielagen; hellend dak; Rc=6,3","Isovlas [220mm dik]"]
[null,null,null,null,"Waterkering, EPDM aluminium versterkt",null,0.5,"m1",null,0,null,"Waterkering, EPDM aluminium versterkt",null,0.5,"m1"]
[null,null,null,null,"Grind",null,8.1,"m2",null,0,null,"Grind",null,8.1,"m2"]
[null,null,null,null,"Dakbedekking; bitumen",null,8.1,"m2",null,{"$f":"G274*I274","v":0},null,"Dakbedekking; bitumen","Losmaakbare EPDM Hertalan Rhinobond",8.1,"m2"]
[null,null,null,null,"Spuitpleister",null,6.4,"m2",null,{"$f":"G275*I275","v":0},null,"Spuitpleister",null,6.4,"m2"]
[null,null,null,null,"Bekledingen en roosters verlaagde plafonds, spaanplaat (incl. regelwerk)",null,93.7,"m2",null,{"$f":"G276*I276","v":0},null,"Bekledingen en roosters verlaagde plafonds, spaanplaat (incl. regelwerk)",null,93.7,"m2"]
[null,null,null,null,"Afgehangen gipskartonplafond, dubbel raster, enkel beplaat zonder isolatie",null,6.4,"m2",null,{"$f":"G277*I277","v":0},null,"Afgehangen gipskartonplafond, dubbel raster, enkel beplaat zonder isolatie",null,6.4,"m2"]
[null,null,null,null,"Prefab houten dakelement, incl. isolatie en beplating",null,110.4,"m2",null,{"$f":"G278*I278","v":0},null,"Prefab houten dakelement, incl. isolatie en beplating","HSB hellend dakelement incl. Isolatie",110.4,"m2"]
[null,null,null,null,"EPS isolatie; Rc=3,5",null,110.4,"st",null,{"$f":"G279*I279","v":0}]
[null,null,null,null,"Dakbedekking, betonpan",null,110.4,"m2",null,{"$f":"G280*I280","v":0},null,"Dakbedekking, betonpan","Hergebruikte keramische pan",110.4,"m2",35,{"$f":"N280*P280","v":3864}]
[null,null,null,null,"Binnenwanden",null,null,null,null,0,null,"Binnenwanden"]
[null,null,null,null,"Keramische tegels; geglazuurd/gelijmd",null,37.1,"m2",null,0,null,"Keramische tegels; geglazuurd/gelijmd","Mosa C2C wandtegels",37.1,"m2",{"$f":"53.83*0.7*1.25","v":47.101249999999993},{"$f":"N282*P282","v":1747.4563749999998}]
[null,null,null,null,"Gipskartonplaat systeemwand; enkel beplaat zonder isolatie",null,17.5,"m2",null,0,null,"Gipskartonplaat systeemwand; enkel beplaat zonder isolatie","Faay biobased systeemwand",17.5,"m2",42.54,744.44999999999993]
[null,null,null,null,"Gipsblokken, normale dichtheid, 70mm",null,59.9,"m2",null,0,null,"Gipsblokken, normale dichtheid, 70mm","HSB binnenwand element",59.9,"m2",120,7188]
[null,null,null,null,"Gipsblokken, hoge dichtheid, 70mm",null,28.7,"m2",null,0,null,"Gipsblokken, hoge dichtheid, 70mm","HSB binnenwand element",28.7,"m2",120,{"$f":"N285*P285","v":3444}]
[null,null,null,null,"Gipsblokken, hoge dichtheid, 70mm",null,12.8,"m2",null,0,null,"Gipsblokken, hoge dichtheid, 70mm","HSB binnenwand element",12.8,"m2",120,{"$f":"N286*P286","v":1536}]
[null,null,null,null,"Vlakke houten vlakke binnendeur; honingraat",null,13,"st",null,0,null,"Vlakke houten vlakke binnendeur; honingraat",null,null,13,"st"]
[null,null,null,null,"Kunststeen binnendorpels",null,1.8,"m1",null,0,null,"Kunststeen binnendorpels",null,null,1.8,"m1"]
[null,null,null,null,"Stalen binnenkozijn",null,32.4,"m2",null,0,null,"Stalen binnenkozijn","Hout; geschilderd",null,32.4,"m2"]
[null,null,null,null,"Klimaatinstallaties",null,null,null,null,0,null,"Klimaatinstallaties"]
[null,null,null,null,"Bodem warmtepomp",null,1,"st",null,0,null,"Bodem warmtepomp",null,null,1,"st"]
[null,null,null,null,"Cv-leidingen",null,180.7,"m2gbo",null,0,null,"Cv-leidingen",null,null,180.7,"m2gbo"]
[null,null,null,null,"Vloerverwarming",null,180.7,"m2gbo",null,0,null,"Vloerverwarming",null,null,180.7,"m2gbo"]
[null,null,null,null,"Compressiekoelmachine",null,180.7,"m2gbo",null,0,null,"Compressiekoelmachine",null,null,180.7,"m2gbo"]
[null,null,null,null,"VLA ventilatiesysteem",null,180.7,"m2gbo",null,0,null,"VLA ventilatiesysteem",null,null,180.7,"m2gbo"]
[null,null,null,null,"Elektrische installaties",null,null,null,null,0,null,"Elektrische installaties"]
[null,null,null,null,"Geïsoleerde installatiedraad en mantelbuis",null,180.7,"m2gbo",null,0,null,"Geïsoleerde installatiedraad en mantelbuis",null,null,180.7,"m2gbo"]
[null,null,null,null,"Pv-panelen",null,7,"m2",188,1316,null,"Pv-panelen","PV CIS zonnepanelen",null,7,"m2",188]
[null,null,null,null,"Toe- en afvoeren",null,null,null,null,0,null,"Toe- en afvoeren"]
[null,null,null,null,"Waterleidingen",null,180.7,"m2gbo",null,0,null,"Waterleidingen",null,null,180.7,"m2gbo"]
[null,null,null,null,"Buitenriolering; pvc",null,180.7,"m2gbo",null,0,null,"Buitenriolering; pvc",null,null,180.7,"m2gbo"]
[null,null,null,null,"Binnenriolering; pvc",null,180.7,"m2gbo",null,0,null,"Binnenriolering; pvc",null,null,180.7,"m2gbo"]
[null,null,null,null,"Aluminium dakgoten",null,19.100000000000001,"m1",null,0,null,"Aluminium dakgoten",null,null,19.100000000000001,"m1"]
[null,null,null,null,"Hemelwaterafvoer; pvc",null,24,"m1",null,0,null,"Hemelwaterafvoer; pvc",null,null,24,"m1"]
[null,null,null,null,"Verkeersruimte",null,null,null,null,0,null,"Verkeersruimte"]
[null,null,null,null,"Houten trap",null,2,"st",null,0,null,"Houten trap",null,null,2,"st"]
[null,null,null,null,"Houten leuningen",null,10.4,"m1",null,0,null,"Houten leuningen",null,null,10.4,"m1"]
[null,null,null,null,"Houten balustrades",null,5.0999999999999996,"m1",null,0,null,"Houten balustrades",null,null,5.0999999999999996,"m1"]
[null,null,null,null,"Vaste voorzieningen",null,null,null,null,0,null,"Vaste voorzieningen"]
[null,null,null,null,"Toiletten; wandcloset + fontein",null,2,"st",null,0,null,"Toiletten; wandcloset + fontein",null,null,2,"st"]
[null,null,null,null,"Keramische wastafel",null,2,"st",null,0,null,"Keramische wastafel",null,null,2,"st"]
[null,null,null,null,"Inloopdouche",null,1,"st",null,0,null,"Inloopdouche",null,null,1,"st"]
[]
[]
[]
[]
[null,null,null,null,"APPARTEMENTENCOMPLEX",null,null,null,null,null,null,"APPARTEMENTENCOMPLEX"]
[]
[]
[]
[]
[]
[]
[]
[]
[]
[]
[]
[]
[]
[null,null,null,null,"Woongebouw M",null,null,null,null,null,null,"Woongebouw M"]
[null,null,null,null,"Element","Materialisatie","Hoeveelheid","Ehd","Ehd.prijs \n(directe bouwkosten)","Totale directe \nbouwkosten",null,"Element","Materialisatie","Hoeveelheid","Ehd","Ehd.prijs \n(directe bouwkosten)","Totale directe \nbouwkosten"]
[]
[null,null,null,null,"Fundering",null,null,null,null,null,null,"Fundering"]
[null,null,null,null,"Grondaanvullingen, zand",null,599.70000000000005,"m2",null,{"$f":"G335*I335","v":0},null,"Grondaanvullingen, zand",null,599.70000000000005,"m2"]
[null,null,null,"FU02","Betonhuis; in het werk gestort",null,207.5,"m1",null,{"$f":"G336*I336","v":0},null,"Betonhuis; in het werk gestort","Beton met 30% recyclaat",207.5,"m1"]
[null,null,null,"FU04","Prefab heipaal",null,595.6,"m1",null,{"$f":"G337*I337","v":0},null,"Prefab heipaal","Beton met 30% recyclaat",595.6,"m1"]
[null,null,null,null,"Vloeren",null,null,null,null,0,null,"Vloeren"]
[null,null,null,"VL13","Prefab beton balkon- en galerijvloer",null,225.6,"m2",null,0,null,"Prefab beton balkon- en galerijvloer","HSB element houten vloer + stalen ophanging (56,8 kg/m2 zie detail berekening excel)",225.6,"m2"]
[null,null,null,"VL14","Aluminium balustrades",null,225.6,"m1",null,0,null,"Aluminium balustrades","Houten balustrade",225.6,"m1"]
[null,null,null,null,"Betonhuis; in het werk gestort",null,567.29999999999995,"m2",null,0,null,"Betonhuis; in het werk gestort","Beton met 30% recyclaat",567.29999999999995,"m2"]
[null,null,null,"VL03","Zandcement dekvloer",null,538.9,"m2",null,0,null,"Zandcement dekvloer",null,538.9,"m2"]
[null,null,null,"VL05","Keramische tegels; geglazuurd/cement",null,23.4,"m2",null,0,null,"Keramische tegels; geglazuurd/cement","Mosa C2C vloertegels",23.4,"m2",{"$f":"53.83*0.7*1.25","v":47.101249999999993},{"$f":"N343*P343","v":1102.1692499999997}]
[null,null,null,"VL07","EPS isolatie; Rc=3,5",null,567.29999999999995,"m2",null,0,null,"EPS isolatie; Rc=3,5",null,567.29999999999995,"m2",{"$f":"22.53*0.7*1.25","v":19.713749999999997},{"$f":"N344*P344","v":11183.610374999998}]
[null,null,null,"VL08","Breedplaatvloer excl. druklaag; 60mm",null,2700.1,"m2",null,0,null,"Breedplaatvloer excl. druklaag; 60mm","CLT verdiepingsvloer [200mm], druklaag [70mm], Gutexisolatie [Rd: 0,55], spaanplaat",2700.1,"m2"]
[null,null,null,"VL09","Druklaag; betonmortel",null,2700.1,"m2",null,0,null,"-","-","-","-","-"]
[null,null,null,"VL10","Zandcement dekvloer",null,2565.1,"m2",null,0,null,"Zandcement dekvloer","Fermacell honingraatvloer (op houten vloer)",2565.1,"m2",{"$f":"(14.75+(2*6.9)+20.73)*0.7*1.25","v":43.11999999999999},{"$f":"N347*P347","v":110607.11199999996}]
[null,null,null,"VL06","Keramische tegels; geglazuurd/cement",null,234.1,"m2",null,0,null,"Keramische tegels; geglazuurd/cement","Mosa C2C vloertegels",234.1,"m2",{"$f":"53.83*0.7*1.25","v":47.101249999999993},{"$f":"N348*P348","v":11026.402624999999}]
[null,null,null,"VL11","Spuitpleister",null,2565.1,"m2",null,0,null,"Spuitpleister",null,2565.1,"m2"]
[null,null,null,null,"Gevel",null,null,null,null,0,null,"Gevel"]
[null,null,null,"GE10","Baksteenmetselwerk",null,1241,"m2",null,{"$f":"G351*I351","v":0},null,"Baksteenmetselwerk","Houten gevelbekleding",1241,"m2",50,{"$f":"N351*P351","v":62050}]
[null,null,null,"GE12","Prefab beton binnenblad; 100mm",null,1116.9000000000001,"m2",null,{"$f":"G352*I352","v":0},null,"Prefab beton binnenblad; 100mm","HSB element incl. isolatie",1116.9000000000001,"m2"]
[null,null,null,"GE11","PUR/PIR schuimplaten isolatie; Rc=4,5",null,1179,"m2",null,{"$f":"G353*I353","v":0}]
[null,null,null,"GE01","Houten buitenkozijnen; draaivalraam, geschilderd",null,532.70000000000005,"m2",null,{"$f":"G354*I354","v":0},null,"Houten buitenkozijnen; draaivalraam, geschilderd","Europees naaldhout, geschilderd",532.70000000000005,"m2"]
[null,null,null,"GE02","Triple glas",null,506,"m2",null,0,null,"Triple glas",null,506,"m2"]
[null,null,null,"GE03","Houten stelkozijnen, geschilderd",null,139,"st",null,0,null,"Houten stelkozijnen, geschilderd",null,139,"st"]
[null,null,null,"GE04","Composietsteen vensterbanken",null,131.6,"m1",null,0,null,"Composietsteen vensterbanken","Vezelcement",131.6,"m1",{"$f":"71.7*0.7*1.25","v":62.737499999999997},{"$f":"N357*P357","v":8256.2549999999992}]
[null,null,null,"GE05","Betonnen waterslagen",null,297.60000000000002,"m1",null,0,null,"Betonnen waterslagen",null,297.60000000000002,"m1"]
[null,null,null,"GE06","Waterkering, EPDM; folie",null,297.60000000000002,"m1",null,0,null,"Waterkering, EPDM; folie",null,297.60000000000002,"m1"]
[null,null,null,"GE07","Stalen lateien; L-ongelijkzijdig",null,297.60000000000002,"m1",null,0,null,"Stalen lateien; L-ongelijkzijdig",null,297.60000000000002,"m1"]
[null,null,null,"GE08","Automatische zonwering (Raffstores)",null,548.29999999999995,"m2",null,0,null,"Automatische zonwering (Raffstores)",null,548.29999999999995,"m2"]
[null,null,null,"GE09","Houten stapeldorpel buitendeur",null,45,"st",null,0,null,"Houten stapeldorpel buitendeur",null,45,"st"]
[null,null,null,null,"Daken",null,null,null,null,0,null,"Daken"]
[null,null,null,null,"Breedplaatvloer excl. druklaag; 60mm",null,567.29999999999995,"m2",null,0,null,"Breedplaatvloer excl. druklaag; 60mm","HSB platdakelement excl isolatie",567.29999999999995,"m2","Kosten opvragen"]
[null,null,null,null,"Druklaag; betonmortel",null,567.29999999999995,"m2",null,0,null,"Druklaag; betonmortel","-",567.29999999999995,"m2"]
[null,null,null,null,"Waterkering, EPDM aluminium versterkt",null,9.4,"m1",null,0,null,"Waterkering, EPDM aluminium versterkt",null,9.4,"m1"]
[null,null,null,null,"Grind",null,562,"m2",null,0,null,"Grind",null,562,"m2"]
[null,null,null,null,"XPS isolatie; hellend dak; Rc=3,5",null,562,"m2",null,0,null,"XPS isolatie; hellend dak; Rc=3,5","IsoVlas [220mm]",562,"m2",{"$f":"22.53*0.7*1.25","v":19.713749999999997},{"$f":"N368*P368","v":11079.127499999999}]
[null,null,null,null,"Dakbedekking; bitumen",null,562,"m2",null,0,null,"Dakbedekking; bitumen","Losmaakbare EPDM Hertalan Rhinobond",562,"m2","Kosten opvragen"]
[null,null,null,null,"Spuitpleister",null,562,"m2",null,0,null,"Spuitpleister",null,562,"m2"]
[null,null,null,null,"Binnenwanden",null,null,null,null,0,null,"Binnenwanden"]
[null,null,null,null,"Prefab beton, niet-dragende binnenwand",null,1692.4,"m2",null,0,null,"Prefab beton, niet-dragende binnenwand","Prefab beton",1692.4,"m2",120,{"$f":"N372*P372","v":203088},"?  6-laags, betonnen kern?"]
[null,null,null,null,"Keramische tegels; geglazuurd/gelijmd",null,824.5,"m2",null,0,null,"Keramische tegels; geglazuurd/gelijmd","Mosa C2C wandtegels",824.5,"m2",{"$f":"53.83*0.7*1.25","v":47.101249999999993},38834.980624999997]
[null,null,null,null,"Gipsblokken, normale dichtheid, 70mm",null,3180.9,"m2",null,0,null,"Gipsblokken, normale dichtheid, 70mm","HSB binnenwand element",3180.9,"m2",120,381708]
[null,null,null,null,"Niet dragende kalkzandsteen lijmblokken, 100mm",null,349,"m2",null,0,null,"Niet dragende kalkzandsteen lijmblokken, 100mm","HSB binnenwand element",349,"m2",120,{"$f":"N375*P375","v":41880}]
[null,null,null,null,"Houten binnenkozijn",null,163.5,"m2",null,0,null,"Houten binnenkozijn",null,163.5,"m2"]
[null,null,null,null,"Vlakke houten vlakke binnendeur; honingraat",null,279,"st",null,0,null,"Vlakke houten vlakke binnendeur; honingraat",null,279,"st"]
[null,null,null,null,"Spaanplaat binnendeur",null,70,"st",null,0,null,"Spaanplaat binnendeur",null,70,"st"]
[null,null,null,null,"Kunststeen binnendorpels",null,125.4,"m1",null,0,null,"Kunststeen binnendorpels",null,125.4,"m1"]
[null,null,null,null,"Stalen binnenkozijn",null,759.4,"m2",null,0,null,"Stalen binnenkozijn","Houten binnenkozijn",759.4,"m2","Kosten?"]
[null,null,null,null,"Klimaatinstallaties",null,null,null,null,0,null,"Klimaatinstallaties"]
[null,null,null,null,"Bodem warmtepomp",null,31,"st",null,0,null,"Bodem warmtepomp",null,31,"st"]
[null,null,null,null,"Cv-leidingen",null,2854.1,"m2gbo",null,0,null,"Cv-leidingen",null,2854.1,"m2gbo"]
[null,null,null,null,"Vloerverwarming",null,2854.1,"m2gbo",null,0,null,"Vloerverwarming",null,2854.1,"m2gbo"]
[null,null,null,null,"VLA ventilatiesysteem",null,2854.1,"m2gbo",null,0,null,"VLA ventilatiesysteem",null,2854.1,"m2gbo"]
[null,null,null,null,"Elektrische installaties",null,null,null,null,0,null,"Elektrische installaties"]
[null,null,null,null,"Geïsoleerde installatiedraad en mantelbuis",null,3024.5,"m2gbo",null,0,null,"Geïsoleerde installatiedraad en mantelbuis",null,3024.5,"m2gbo"]
[null,null,null,null,"Pv-panelen",null,291.39999999999998,"m2",188,54783.199999999997,null,"Pv-panelen","PV CIS zonnepanelen",291.39999999999998,"m2",null,188]
[null,null,null,null,"Verlichting, armaturen en lampen, LED-120cm",null,625.1,"m2gbo",null,0,null,"Verlichting, armaturen en lampen, LED-120cm",null,625.1,"m2gbo"]
[null,null,null,null,"Toe- en afvoeren",null,null,null,null,0,null,"Toe- en afvoeren"]
[null,null,null,null,"Waterleidingen",null,2854.1,"m2gbo",null,0,null,"Waterleidingen",null,2854.1,"m2gbo"]
[null,null,null,null,"Buitenriolering; pvc",null,2854.1,"m2gbo",null,0,null,"Buitenriolering; pvc",null,2854.1,"m2gbo"]
[null,null,null,null,"Binnenriolering; pvc",null,2854.1,"m2gbo",null,0,null,"Binnenriolering; pvc",null,2854.1,"m2gbo"]
[null,null,null,null,"Hemelwaterafvoer; pvc",null,169.1,"m1",null,0,null,"Hemelwaterafvoer; pvc",null,169.1,"m1"]
[null,null,null,null,"Verkeersruimte",null,null,null,null,0,null,"Verkeersruimte"]
[null,null,null,null,"Prefab beton trap, incl. bordes",null,5,"st",null,0,null,"Prefab beton trap, incl. bordes",null,5,"st"]
[null,null,null,null,"Aluminium balustrades",null,1.1000000000000001,"m1",null,0,null,"Aluminium balustrades","Houten balustrades",1.1000000000000001,"m1"]
[null,null,null,null,"Aluminium leuningen",null,24.4,"m1",null,0,null,"Aluminium leuningen","Houten leuningen",24.4,"m1"]
[null,null,null,null,"Lift, stalen personenlift",null,1,"st",null,0,null,"Lift, stalen personenlift",null,1,"st"]
[null,null,null,null,"Liftinstallaties",null,6,"st",null,0,null,"Liftinstallaties",null,6,"st"]
[null,null,null,null,"Vaste voorzieningen",null,null,null,null,0,null,"Vaste voorzieningen"]
[null,null,null,null,"Toiletten; wandcloset + fontein",null,62,"st",null,0,null,"Toiletten; wandcloset + fontein",null,62,"st","st"]
[null,null,null,null,"Keramische wastafel",null,62,"st",null,0,null,"Keramische wastafel",null,62,"st","st"]
[null,null,null,null,"Inloopdouche",null,31,"st",null,0,null,"Inloopdouche",null,31,"st","st"]
[]
[]
[]
[null,null,null,null,"Woongebouw XL studio's",null,null,null,null,null,null,"Woongebouw XL studio's"]
[null,null,null,null,"Element","Materialisatie","Hoeveelheid","Ehd","Ehd.prijs \n(directe bouwkosten)","Totale directe \nbouwkosten",null,"Element","Materialisatie","Hoeveelheid","Ehd","Ehd.prijs \n(directe bouwkosten)","Totale directe \nbouwkosten"]
[]
[null,null,null,null,"Fundering",null,null,null,null,null,null,"Fundering"]
[null,null,null,"FU02","Betonhuis; in het werk gestort",null,753.3,"m1",null,{"$f":"G412*I412","v":0},null,"Betonhuis; in het werk gestort","Beton met 30% recyclaat",753.3,"m1"]
[null,null,null,"FU04","Prefab heipaal",null,3013,"m1",null,{"$f":"G413*I413","v":0},null,"Prefab heipaal","Beton met 30% recyclaat",3013,"m1"]
[null,null,null,null,"Betonnen kelderwanden; in het werk gestort",null,62.8,"m2",null,0,null,"Betonnen kelderwanden; in het werk gestort","Beton met 30% recyclaat",62.8,"m2"]
[null,null,null,null,"EPS platen isolatie; Rc=4,5",null,62.8,"m2",null,0,null,"EPS platen isolatie; Rc=4,5"]
[null,null,null,null,"Vloeren",null,null,null,null,0,null,"Vloeren"]
[null,null,null,"VL01","Bodemafsluiting, zand",null,2870.9,"m2",null,0,null,"Bodemafsluiting, zand",null,null,2870.9,"m2"]
[null,null,null,"VL13","Prefab beton balkon- en galerijvloer",null,173,"m2",null,0,null,"Prefab beton balkon- en galerijvloer","HSB element houten vloer + stalen ophanging (56,8 kg/m2 zie detail berekening excel)",null,173,"m2",null,{"$f":"56.8*O418","v":9826.4}]
[null,null,null,null,"Betonhuis; in het werk gestort",null,2870.9,"m2",null,0,null,"Betonhuis; in het werk gestort","Beton met 30% recyclaat",null,2870.9,"m2"]
[null,null,null,"VL07","EPS isolatie; Rc=3,5",null,2870.9,"m2",null,0,null,"EPS isolatie; Rc=3,5",null,2870.9,"m2",{"$f":"22.53*0.7*1.25","v":19.713749999999997},{"$f":"N420*P420","v":56596.204874999996}]
[null,null,null,"VL08","Breedplaatvloer excl. druklaag; 60mm",null,24285.8,"m2",null,0,null,"Breedplaatvloer excl. druklaag; 60mm","CLT verdiepingsvloer [200mm], druklaag [70mm], Gutexisolatie [Rd: 0,55], spaanplaat",null,24285.8,"m2"]
[null,null,null,"VL09","Druklaag; betonmortel",null,24285.8,"m2",null,0,null,"-",null,"-","-","-","-"]
[null,null,null,"Vl05","Keramische tegels; geglazuurd/cement",null,3624,"m2",null,0,null,"Keramische tegels; geglazuurd/cement","Mosa C2C vloertegels",3624,"m2",{"$f":"53.83*0.7*1.25","v":47.101249999999993},{"$f":"N423*P423","v":170694.92999999996},"15-20%","beton"]
[null,null,null,null,"Bekledingen en roosters verlaagde plafonds, steenwoltegels",null,302,"m2",null,0,null,"Bekledingen en roosters verlaagde plafonds, steenwoltegels",null,null,302,"m2"]
[null,null,null,"VL04","Anhydriet gietvloer, zwevend op 20mm polystyreen",null,24285.8,"m2",null,0,null,"Anhydriet gietvloer, zwevend op 20mm polystyreen","Fermacell honingraatvloer (op houten vloer)",null,24285.8,"m2"]
[null,null,null,null,"Gevel",null,null,null,null,0,null,"Gevel"]
[null,null,null,"GE10","Baksteenmetselwerk",null,7458.7,"m2",null,{"$f":"G427*I427","v":0},null,"Baksteenmetselwerk","Houten gevelbekleding",7458.7,"m2",50,{"$f":"N427*P427","v":372935}]
[null,null,null,"GE12","Prefab beton binnenblad; 100mm",null,7458.7,"m2",null,{"$f":"G428*I428","v":0},null,"Prefab beton binnenblad; 100mm","HSB element",null,7458.7,"m2"]
[null,null,null,"GE11","PUR/PIR schuimplaten isolatie; Rc=4,5",null,7458.7,"m2",null,{"$f":"G429*I429","v":0}]
[null,null,null,null,"Aluminium buitendeur",null,9,"m2",null,{"$f":"G430*I430","v":0},null,"Aluminium buitendeur","Houten buitendeur",null,9,"m2"]
[null,null,null,null,"Aluminium buitenkozijnen; vast en/of draaiend",null,3819,"m2",null,0,null,"Aluminium buitenkozijnen; vast en/of draaiend","Houten kozijnen",null,3819,"m2"]
[null,null,null,"GE02","Triple glas",null,3195.5,"m2",null,0,null,"Triple glas",null,null,3195.5,"m2"]
[null,null,null,"GE03","Houten stelkozijnen, geschilderd",null,662,"st",null,0,null,"Houten stelkozijnen, geschilderd",null,null,662,"st"]
[null,null,null,null,"Kunststeen vensterbanken",null,2000,"m1",null,0,null,"Kunststeen vensterbanken","Vezelcement",2000,"m1",{"$f":"71.7*0.7*1.25","v":62.737499999999997},{"$f":"N434*P434","v":125475}]
[null,null,null,null,"Ventilatierooster, aluminium",null,2000,"m1",null,0,null,"Ventilatierooster, aluminium",null,null,2000,"m1"]
[null,null,null,"GE06","Waterkering, EPDM; folie",null,6893.1,"m1",null,0,null,"Waterkering, EPDM; folie",null,null,6893.1,"m1"]
[null,null,null,"GE07","Stalen lateien; L-ongelijkzijdig",null,2000,"m1",null,0,null,"Stalen lateien; L-ongelijkzijdig",null,null,2000,"m1"]
[null,null,null,"GE08","Automatische zonwering (Raffstores)",null,3195.5,"m2",null,0,null,"Automatische zonwering (Raffstores)",null,null,3195.5,"m2"]
[null,null,null,null,"Daken",null,null,null,null,0,null,"Daken"]
[null,null,null,null,"Breedplaatvloer excl. druklaag; 60mm",null,2870.9,"m2",null,0,null,"Breedplaatvloer excl. druklaag; 60mm","HSB platdakelement excl isoaltie",2870.9,"m2","Kosten opvragen"]
[null,null,null,null,"Druklaag; betonmortel",null,2870.9,"m2",null,0,null,"-","-","-","-","-","-"]
[null,null,null,null,"Dakbedekking; bitumen",null,2870.9,"m2",null,0,null,"Dakbedekking; bitumen","Losmaakbare EPDM Rhinobond",2870.9,"m2","Kosten opvragen"]
[null,null,null,null,"Waterkering, EPDM aluminium versterkt",null,410,"m1",null,0,null,"Waterkering, EPDM aluminium versterkt",null,410,"m1"]
[null,null,null,null,"XPS isolatie; hellend dak; Rc=3,5",null,2870.9,"m2",null,0,null,"XPS isolatie; hellend dak; Rc=3,5","IsoVlas [220mm]",2870.9,"m2",{"$f":"22.53*0.7*1.25","v":19.713749999999997},{"$f":"N444*P444","v":56596.204874999996}]
[null,null,null,null,"Binnenwanden",null,null,null,null,0,null,"Binnenwanden"]
[null,null,null,null,"Prefab beton, niet-dragende binnenwand",null,2259.9,"m2",null,0,null,"Prefab beton, niet-dragende binnenwand","Prefab beton",2259.9,"m2",null,null,"constructieve betonkern"]
[null,null,null,null,"Spuitpleister",null,93082.6,"m2",null,0,null,"Spuitpleister",null,93082.6,"m2"]
[null,null,null,null,"Keramische tegels; geglazuurd/gelijmd",null,18120,"m2",null,0,null,"Keramische tegels; geglazuurd/gelijmd","Mosa C2C wandtegels",18120,"m2",{"$f":"53.83*0.7*1.25","v":47.101249999999993},{"$f":"N448*P448","v":853474.64999999991}]
[null,null,null,null,"Gipsblokken, normale dichtheid, 70mm",null,11778,"m2",null,0,null,"Gipsblokken, normale dichtheid, 70mm","HSB binnenwand element",11778,"m2",120,1413360]
[null,null,null,null,"Gipsblokken, hoge dichtheid, 70mm",null,29233.599999999999,"m2",null,0,null,"Gipsblokken, hoge dichtheid, 70mm","HSB binnenwand element",29233.599999999999,"m2",120,{"$f":"N450*P450","v":3508032}]
[null,null,null,null,"Stalen binnenkozijn",null,2899,"m2",null,0,null,"Stalen binnenkozijn","Houten binnenkozijn",2899,"m2","Kosten opvragen"]
[null,null,null,null,"Vlakke houten vlakke binnendeur; honingraat",null,1812,"st",null,0,null,"Vlakke houten vlakke binnendeur; honingraat",null,null,1812,"st"]
[null,null,null,null,"Binnenbeglazing, enkel glas",null,141.30000000000001,"m2",null,0,null,"Binnenbeglazing, enkel glas",null,null,141.30000000000001,"m2"]
[null,null,null,null,"Kunststeen binnendorpels",null,1208,"m1",null,0,null,"Kunststeen binnendorpels",null,null,1208,"m1"]
[null,null,null,null,"Stalen binnenkozijn",null,1450,"m2",null,0,null,"Stalen binnenkozijn","Houten binnenkozijn",1450,"m2","Kosten opvragen"]
[null,null,null,null,"Klimaatinstallaties",null,null,null,null,0,null,"Klimaatinstallaties"]
[null,null,null,null,"Bodem warmtepomp",null,604,"st",null,0,null,"Bodem warmtepomp",null,null,604,"st"]
[null,null,null,null,"Cv-leidingen",null,21241,"m2gbo",null,0,null,"Cv-leidingen",null,null,21241,"m2gbo"]
[null,null,null,null,"Vloerverwarming",null,21241,"m2gbo",null,0,null,"Vloerverwarming",null,null,21241,"m2gbo"]
[null,null,null,null,"VLA ventilatiesysteem",null,21241,"m2gbo",null,0,null,"VLA ventilatiesysteem",null,null,21241,"m2gbo"]
[null,null,null,null,"Elektrische installaties",null,null,null,null,0,null,"Elektrische installaties"]
[null,null,null,null,"Geïsoleerde installatiedraad en mantelbuis",null,21241,"m2gbo",null,0,null,"Geïsoleerde installatiedraad en mantelbuis",null,null,21241,"m2gbo"]
[null,null,null,null,"Pv-panelen",null,1800,"m2",188,338400,null,"Pv-panelen","PV CIS zonnepanelen",null,1800,"m2",188]
[null,null,null,null,"Verlichting, armaturen en lampen, LED-120cm",null,21241,"m2gbo",null,0,null,"Verlichting, armaturen en lampen, LED-120cm",null,null,21241,"m2gbo"]
[null,null,null,null,"Toe- en afvoeren",null,null,null,null,0,null,"Toe- en afvoeren"]
[null,null,null,null,"Waterleidingen",null,21241,"m2gbo",null,0,null,"Waterleidingen",null,null,21241,"m2gbo"]
[null,null,null,null,"Buitenriolering; pvc",null,21241,"m2gbo",null,0,null,"Buitenriolering; pvc",null,null,21241,"m2gbo"]
[null,null,null,null,"Binnenriolering; pvc",null,21241,"m2gbo",null,0,null,"Binnenriolering; pvc",null,null,21241,"m2gbo"]
[null,null,null,null,"Hemelwaterafvoer; pvc",null,306,"m1",null,0,null,"Hemelwaterafvoer; pvc",null,null,306,"m1"]
[null,null,null,null,"Verkeersruimte",null,null,null,null,0,null,"Verkeersruimte"]
[null,null,null,null,"Prefab beton trap, incl. bordes",null,45,"st",null,0,null,"Prefab beton trap, incl. bordes",null,null,45,"st"]
[null,null,null,null,"Aluminium balustrades",null,202,"m1",null,0,null,"Aluminium balustrades","Houten balustrades",202,"m1","Kosten opvragen"]
[null,null,null,null,"Aluminium leuningen",null,200,"m1",null,0,null,"Aluminium leuningen","Houten leuningen",200,"m1","Kosten opvragen"]
[null,null,null,null,"Lift, stalen personenlift",null,4,"st",null,0,null,"Lift, stalen personenlift",null,null,4,"st"]
[null,null,null,null,"Liftinstallaties",null,35,"st",null,0,null,"Liftinstallaties",null,null,35,"st"]
[null,null,null,null,"Vaste voorzieningen",null,null,null,null,0,null,"Vaste voorzieningen"]
[null,null,null,null,"Toiletten; wandcloset + fontein",null,604,"st",null,0,null,"Toiletten; wandcloset + fontein",null,null,604,"st"]
[null,null,null,null,"Keramische wastafel",null,604,"st",null,0,null,"Keramische wastafel",null,null,604,"st"]
[null,null,null,null,"Inloopdouche",null,604,"st",null,0,null,"Inloopdouche",null,null,604,"st"]