{"text_format":"1","workbook":"xlsx","n_sheets":3,"sheets":["Input Wonen","Maatregelen nieuwbouw","Input P1"],"not_rendered":{"charts":0,"images":16,"macros":0,"external_links":5,"defined_names":72,"comments":4,"pivot_tables":0},"unopened":[],"bounds":{"document_bytes":16777216,"sheet_cells":100000,"rows_first":2000,"rows_last":500,"rows_between":2000,"halvings":0,"cell_chars":16384,"cell_head_chars":4096},"cells_cut":0,"cells_raw":0,"read":"whole","date_system":"1900"}

{"sheet":"Input Wonen","index":0,"n_rows":187,"n_cols":32,"rows_kept":187,"cut":false,"hidden":true,"merged":[[183,4,183,7],[183,10,183,13],[183,16,183,19],[185,4,185,7],[185,10,185,13],[185,16,185,19],[176,4,176,7],[176,10,176,13],[176,16,176,19],[181,4,181,7],[181,10,181,13],[181,16,181,19],[151,4,151,7],[151,10,151,13],[147,4,147,7],[147,10,147,13],[115,4,115,7],[115,10,115,13],[124,4,124,7],[124,10,124,13],[130,4,130,7],[130,10,130,13],[136,4,136,7],[136,10,136,13],[27,4,27,7],[27,10,27,13],[49,4,49,7],[49,10,49,13],[78,4,78,7],[78,10,78,13],[45,4,45,7],[45,10,45,13],[10,11,11,11],[10,13,11,13],[12,4,12,7],[12,10,12,13],[3,5,3,7],[10,4,11,4],[10,5,11,5],[10,7,11,7],[10,10,11,10],[10,6,11,6],[10,12,11,12],[10,16,11,16],[10,17,11,17],[10,18,11,18],[10,19,11,19],[12,16,12,19],[130,16,130,19],[136,16,136,19],[147,16,147,19],[151,16,151,19],[27,16,27,19],[49,16,49,19],[78,16,78,19],[115,16,115,19],[124,16,124,19],[45,16,45,19]]}
[]
[]
[null,null,null,null,"Project",null,null,null,null,null,null,null,null,null,null,null,null,null,null,null,"Projectcode:",null,"0447.005"]
[null,null,null,null,"Onderwerp",null,null,null,null,null,"REKENING HOUDEN MET CA 10% EXTRA KOSTEN VOOR WERKZAAMHEDEN DIE NIET INBEGREPEN",null,null,null,null,null,"REKENING HOUDEN MET CA 10% EXTRA KOSTEN VOOR WERKZAAMHEDEN DIE NIET INBEGREPEN"]
[null,null,null,null,"Opgesteld",null,null,null,null,null,"ZIJN IN ONDERSTAANDE WERKZAAMHEDEN. ZOALS: KLEIN TIMMERWERK, SCHILDERWERK, GRONDWERK ",null,null,null,null,null,"ZIJN IN ONDERSTAANDE WERKZAAMHEDEN. ZOALS: KLEIN TIMMERWERK, SCHILDERWERK, GRONDWERK ",null,null,null,"Versie:",null,"0.1"]
[null,null,null,null,"Gecontroleerd",null,null,null,null,null,"EN STEIGER",null,null,null,null,null,"EN STEIGER",null,null,null,"Versie datum:",null,"2022-04-25"]
[null,null,null,null,"Bestand:",null,null,null,null,null,null,null,null,null,null,null,null,null,null,null,"Status:",null,"concept"]
[]
[null,null,null,null,null,null,null,null,null,null,null,null,null,{"$f":"500*0.35*0.47","v":82.25}]
[null,null,null,null,"Traditioneel (RVO Referentieprojecten)",null,null,null,null,null,"Het Nieuwe Normaal 0.4 (HNN0.4)",null,null,null,null,null,"Excellent",null,null,null,null,null,null,"gevel = buitenspouwblad + kozijnen","bg vloer","dak"]
[null,null,null,null,"Element","Materialisatie","Ehd","Ehd.prijs \n(directe bouwkosten)",null,null,"Element","Materialisatie","Ehd","Ehd.prijs \n(directe bouwkosten)",null,null,"Element","Materialisatie","Ehd","Ehd.prijs \n(directe bouwkosten)",null,"Woning","BVO","BGO","BBO","BDO","won"]
[null,null,null,null,null,null,null,null,null,null,null,null,null,null,null,null,null,null,null,null,null,"Woning S tussen",146,{"$f":"#REF!+#REF!","v":{"$error":"#REF!"}},{"$f":"#REF!","v":{"$error":"#REF!"}},{"$f":"#REF!","v":{"$error":"#REF!"}},1,null,null,"Mortel schroefpaal 15 m1","Rond 300",40]
[null,null,null,"ID","Fundering",null,null,null,null,"ID","Fundering",null,null,null,null,"ID","Fundering",null,null,null,null,"Woning 2,5 laag",145,99,54,54,1,null,null,"Mortel schroefpaal 15 m1","Rond 300",40]
[null,null,null,"FU01.t","Funderingsbalken, 350x470mm","In het werk gestort","m1",{"$f":"ROUND((0.35*0.47)*600,-0.1)+1","v":100},null,"FU01.HNN","Funderingsbalken, 350x470mm","Beton met 56% aan secundair aandeel (UMC)","m1",{"$f":"N15","v":109},null,"FU01.E","Funderingsbalken, 350x470mm","Beton met 56% aan secundair aandeel (UMC)","m1",{"$f":"T15","v":109},null,"Woning M hoek",180,{"$f":"#REF!+#REF!","v":{"$error":"#REF!"}},{"$f":"#REF!","v":{"$error":"#REF!"}},{"$f":"#REF!","v":{"$error":"#REF!"}},1,31,null,"Mortel schroefpaal 15 m1","Rond 300",40]
[null,null,null,"FU11.t","Funderingsbalken, 350x470mm","In het werk gestort","m1",{"$f":"ROUND((0.35*0.47)*600,-0.1)+1","v":100},null,"FU11.HNN","Funderingsbalken, 350x470mm","Beton met 56% aan secundair aandeel (UMC)","m1",{"$f":"ROUND((0.35*0.47)*650,-0.1)+2","v":109},null,"FU11.E","Funderingsbalken, 350x470mm","Beton met 56% aan secundair aandeel (UMC)","m1",{"$f":"N15","v":109},null,"Woning M hoek",180,{"$f":"#REF!+#REF!","v":{"$error":"#REF!"}},{"$f":"#REF!","v":{"$error":"#REF!"}},{"$f":"#REF!","v":{"$error":"#REF!"}},1,31,null,"Mortel schroefpaal 15 m1","Rond 300",40]
[null,null,null,"FU02.t","Funderingsbalken, 400x500mm","In het werk gestort","m1",{"$f":"ROUND((0.4*0.5)*600,-0.1)","v":120},null,"FU02.HNN","Funderingsbalken, 400x500mm","Beton met 56% aan secundair aandeel (UMC)","m1",{"$f":"N17","v":129},null,"FU02.E","Funderingsbalken, 400x500mm","Beton met 56% aan secundair aandeel (UMC)","m1",{"$f":"T17","v":129},null,"Woongebouw M",3830,{"$f":"#REF!+#REF!","v":{"$error":"#REF!"}},{"$f":"#REF!","v":{"$error":"#REF!"}},{"$f":"#REF!","v":{"$error":"#REF!"}},31,{"$f":"W16/AA16","v":123.54838709677419},null,"Mortel schroefpaal 20 m1","Rond 350",45]
[null,null,null,"FU09.t","Funderingsbalken, 400x500mm","In het werk gestort","m1",{"$f":"ROUND((0.4*0.5)*600,-0.1)","v":120},null,"FU09.HNN","Funderingsbalken, 400x500mm","Beton met 56% aan secundair aandeel (UMC)","m1",{"$f":"ROUND((0.4*0.5)*650,-0.1)-1","v":129},null,"FU09.E","Funderingsbalken, 400x500mm","Beton met 56% aan secundair aandeel (UMC)","m1",{"$f":"N17","v":129},null,"Woongebouw M",3830,{"$f":"#REF!+#REF!","v":{"$error":"#REF!"}},{"$f":"#REF!","v":{"$error":"#REF!"}},{"$f":"#REF!","v":{"$error":"#REF!"}},31,null,null,"Mortel schroefpaal 20 m1","Rond 350",45]
[null,null,null,"FU06.t","Funderingsbalken, 600x600mm","In het werk gestort","m1",{"$f":"ROUND((0.6*0.6)*600,-0.1)+4","v":220},null,"FU06.HNN","Funderingsbalken, 600x600mm","Beton met 56% aan secundair aandeel (UMC)","m1",{"$f":"N19","v":234},null,"FU06.E","Funderingsbalken, 600x600mm","Beton met 56% aan secundair aandeel (UMC)","m1",{"$f":"T19","v":234}]
[null,null,null,"FU13.t","Funderingsbalken, 600x600mm","In het werk gestort","m1",{"$f":"ROUND((0.6*0.6)*600,-0.1)+4","v":220},null,"FU13.HNN","Funderingsbalken, 600x600mm","Beton met 56% aan secundair aandeel (UMC)","m1",{"$f":"ROUND((0.6*0.6)*650,-0.1)","v":234},null,"FU13.E","Funderingsbalken, 600x600mm","Beton met 56% aan secundair aandeel (UMC)","m1",{"$f":"N19","v":234}]
[null,null,null,"FU03.t","Funderingspaal, ⌀ 300mm; l=15,0m","Schroefpaal; beton, in het werk gestort, C20/25,CEMIII; incl.wapening","m1",50,null,"FU03.HNN","Funderingspaal, ⌀ 300mm; l=15,0m","Beton met 56% aan secundair aandeel (UMC)","m1",{"$f":"N21","v":55},null,"FU03.E","Funderingspaal, ⌀ 300mm; l=15,0m","Beton met 56% aan secundair aandeel (UMC)","m1",{"$f":"T21","v":55},null,"Woonschijf",12400,5382,1550,1550,140,{"$f":"W20/AA20","v":88.571428571428569},null,"Mortel schroefpaal 25 m1","Rond 500",70]
[null,null,null,"FU10.t","Funderingspaal, ⌀ 300mm; l=15,0m","Schroefpaal; beton, in het werk gestort, C20/25,CEMIII; incl.wapening","m1",50,null,"FU10.HNN","Funderingspaal, ⌀ 300mm; l=15,0m","Beton met 56% aan secundair aandeel (UMC)","m1",{"$f":"H21+5","v":55},null,"FU10.E","Funderingspaal, ⌀ 300mm; l=15,0m","Beton met 56% aan secundair aandeel (UMC)","m1",{"$f":"N21","v":55},null,"Woonschijf",12400,5382,1550,1550,140,null,null,"Mortel schroefpaal 25 m1","Rond 500",70]
[null,null,null,"FU04.t","Funderingspaal, ⌀ 350mm, l=20,0m","Schroefpaal; beton, in het werk gestort, C20/25,CEMIII; incl.wapening","m1",60,null,"FU04.HNN","Funderingspaal, ⌀ 350mm, l=20,0m","Beton met 56% aan secundair aandeel (UMC)","m1",{"$f":"N23","v":65},null,"FU04.E","Funderingspaal, ⌀ 350mm, l=20,0m","Beton met 56% aan secundair aandeel (UMC)","m1",{"$f":"T23","v":65},null,"Toren",26544,10118,1106,1106,312,null,null,"Mortel schroefpaal 25 m1","Rond 500",70]
[null,null,null,"FU12.t","Funderingspaal, ⌀ 350mm; l=15,0m","Schroefpaal; beton, in het werk gestort, C20/25,CEMIII; incl.wapening","m1",60,null,"FU12.HNN","Funderingspaal, ⌀ 350mm; l=15,0m","Beton met 56% aan secundair aandeel (UMC)","m1",{"$f":"H23+5","v":65},null,"FU12.E","Funderingspaal, ⌀ 350mm; l=15,0m","Beton met 56% aan secundair aandeel (UMC)","m1",{"$f":"N23","v":65},null,"Toren",26544,10118,1106,1106,312,null,null,"Mortel schroefpaal 25 m1","Rond 500",70]
[null,null,null,"FU08.t","Funderingspaal, ⌀ 500mm; l=25,0m","Schroefpaal; beton, in het werk gestort, C20/25,CEMIII; incl.wapening","m1",80,null,"FU08.HNN","Funderingspaal, ⌀ 500mm; l=25,0m","Beton met 56% aan secundair aandeel (UMC)","m1",{"$f":"N25","v":85},null,"FU08.E","Funderingspaal, ⌀ 500mm; l=25,0m","Beton met 56% aan secundair aandeel (UMC)","m1",{"$f":"T25","v":85},null,"Galerij",10144,7341,1268,1268,136,null,null,"Mortel schroefpaal 25 m1","Rond 500",70]
[null,null,null,"FU14.t","Funderingspaal, ⌀ 500mm; l=25,0m","Schroefpaal; beton, in het werk gestort, C20/25,CEMIII; incl.wapening","m1",80,null,"FU14.HNN","Funderingspaal, ⌀ 500mm; l=25,0m","Beton met 56% aan secundair aandeel (UMC)","m1",{"$f":"H25+5","v":85},null,"FU14.E","Funderingspaal, ⌀ 500mm; l=25,0m","Beton met 56% aan secundair aandeel (UMC)","m1",{"$f":"N25","v":85},null,"Galerij",10144,7341,1268,1268,136,null,null,"Mortel schroefpaal 25 m1","Rond 500",70]
[null,null,null,"FU05.t","Bodemafsluiting, zand","Zand","m2",{"$f":"35*0.1","v":3.5},null,"FU05.HNN","Bodemafsluiting, 100 zand","Zand","m2",{"$f":"H26","v":3.5},null,"FU05.E","Bodemafsluiting, 100 zand","Zand","m2",{"$f":"N26","v":3.5}]
[null,null,null,"FU07.t","Opgaand metselwerk","Kalkzandsteen lijmblokken, 100mm","m2",75,null,"FU07.HNN","Opgaand metselwerk","Kalkzandsteen lijmblokken, 100mm","m2",{"$f":"H27","v":75},null,"FU07.E","Opgaand metselwerk","Kalkzandsteen lijmblokken, 100mm","m2",{"$f":"N27","v":75}]
[null,null,null,null,"Vloeren",null,null,null,null,null,"Vloeren",null,null,null,null,null,"Vloeren"]
[null,null,null,"VL01.t","BG: ribbenvloer, vrijdragend incl. isolatie (Rc=3,7)","Prefab beton","m2",75,null,"VL01.HNN","BG: kanaalplaatvloer, 200mm incl. isolatie (Rc=3,7)","Kanaalplaat, remontabel (28% recyclaat)","m2",96,null,"VL01.E","BG: kanaalplaatvloer, 200mm incl. isolatie (Rc=3,7)","Kanaalplaat, remontabel (28% recyclaat)","m2",{"$f":"N29","v":96}]
[null,null,null,"VL11.t","BG: kanaalplaatvloer, 200mm incl. isolatie (Rc=3,7)","Kanaalplaatvloer; prefab beton","m2",95,null,"VL11.HNN","BG: kanaalplaatvloer, 200mm incl. isolatie (Rc=3,7)","Kanaalplaat, remontabel (28% recyclaat)","m2",{"$f":"H30+15","v":110},null,"VL11.E","BG: kanaalplaatvloer, 200mm incl. isolatie (Rc=3,7)","Kanaalplaat, remontabel (28% recyclaat)","m2",{"$f":"N30","v":110}]
{"$rows_left_out":158}
{"sheet":"Maatregelen nieuwbouw","index":1,"n_rows":659,"n_cols":14,"rows_kept":659,"cut":false,"hidden":false,"merged":[[28,4,28,5],[28,8,28,9],[28,12,28,13],[32,4,32,5],[32,8,32,9],[32,12,32,13],[25,4,25,5],[25,8,25,9],[25,12,25,13],[26,4,27,4],[26,5,27,5],[26,8,27,8],[26,9,27,9],[26,12,27,12],[26,13,27,13],[62,4,62,5],[62,8,62,9],[62,12,62,13],[68,4,68,5],[68,8,68,9],[68,12,68,13],[39,4,39,5],[39,8,39,9],[39,12,39,13],[49,4,49,5],[49,8,49,9],[49,12,49,13],[81,4,81,5],[81,8,81,9],[81,12,81,13],[85,4,85,5],[85,8,85,9],[85,12,85,13],[71,4,71,5],[71,8,71,9],[71,12,71,13],[77,4,77,5],[77,8,77,9],[77,12,77,13],[88,4,88,5],[88,8,88,9],[88,12,88,13],[89,4,89,5],[89,8,89,9],[89,12,89,13],[86,4,86,5],[86,8,86,9],[86,12,86,13],[87,4,87,5],[87,8,87,9],[87,12,87,13],[110,4,110,5],[110,8,110,9],[110,12,110,13],[114,4,114,5],[114,8,114,9],[114,12,114,13],[107,4,107,5],[107,8,107,9],[107,12,107,13],[108,4,109,4],[108,5,109,5],[108,8,109,8],[108,9,109,9],[108,12,109,12],[108,13,109,13],[135,4,135,5],[135,8,135,9],[135,12,135,13],[144,4,144,5],[144,8,144,9],[144,12,144,13],[121,4,121,5],[121,8,121,9],[121,12,121,13],[131,4,131,5],[131,8,131,9],[131,12,131,13],[158,4,158,5],[158,8,158,9],[158,12,158,13],[162,4,162,5],[162,8,162,9],[162,12,162,13],[149,4,149,5],[149,8,149,9],[149,12,149,13],[152,4,152,5],[152,8,152,9],[152,12,152,13],[168,4,168,5],[168,8,168,9],[168,12,168,13],[169,4,169,5],[169,8,169,9],[169,12,169,13],[166,4,166,5],[166,8,166,9],[166,12,166,13],[167,4,167,5],[167,8,167,9],[167,12,167,13],[190,4,191,4],[190,5,191,5],[190,8,191,8],[190,9,191,9],[190,12,191,12],[190,13,191,13],[170,4,170,5],[170,8,170,9],[170,12,170,13],[189,4,189,5],[189,8,189,9],[189,12,189,13],[204,4,204,5],[204,8,204,9],[204,12,204,13],[206,4,206,5],[206,8,206,9],[206,12,206,13],[192,4,192,5],[192,8,192,9],[192,12,192,13],[197,4,197,5],[197,8,197,9],[197,12,197,13],[228,4,228,5],[228,8,228,9],[228,12,228,13],[235,4,235,5],[235,8,235,9],[235,12,235,13],[215,4,215,5],[215,8,215,9],[215,12,215,13],[221,4,221,5],[221,8,221,9],[221,12,221,13],[247,4,247,5],[247,8,247,9],[247,12,247,13],[251,4,251,5],[251,8,251,9],[251,12,251,13],[238,4,238,5],[238,8,238,9],[238,12,238,13],[243,4,243,5],[243,8,243,9],[243,12,243,13],[254,4,254,5],[254,8,254,9],[254,12,254,13],[255,4,255,5],[255,8,255,9],[255,12,255,13],[252,4,252,5],[252,8,252,9],[252,12,252,13],[253,4,253,5],[253,8,253,9],[253,12,253,13],[277,4,277,5],[277,8,277,9],[277,12,277,13],[281,4,281,5],[281,8,281,9],[281,12,281,13],[274,4,274,5],[274,8,274,9],[274,12,274,13],[275,4,276,4],[275,5,276,5],[275,8,276,8],[275,9,276,9],[275,12,276,12],[275,13,276,13],[306,4,306,5],[306,8,306,9],[306,12,306,13],[315,4,315,5],[315,8,315,9],[315,12,315,13],[290,4,290,5],[290,8,290,9],[290,12,290,13],[300,4,300,5],[300,8,300,9],[300,12,300,13],[330,4,330,5],[330,8,330,9],[330,12,330,13],[335,4,335,5],[335,8,335,9],[335,12,335,13],[321,4,321,5],[321,8,321,9],[321,12,321,13],[325,4,325,5],[325,8,325,9],[325,12,325,13],[341,4,341,5],[341,8,341,9],[341,12,341,13],[342,4,342,5],[342,8,342,9],[342,12,342,13],[339,4,339,5],[339,8,339,9],[339,12,339,13],[340,4,340,5],[340,8,340,9],[340,12,340,13],[345,4,345,5],[345,8,345,9],[345,12,345,13],[364,4,364,5],[364,8,364,9],[364,12,364,13],[343,4,343,5],[343,8,343,9],[343,12,343,13],[344,4,344,5],[344,8,344,9],[344,12,344,13],[367,4,367,5],[367,8,367,9],[367,12,367,13],[372,4,372,5],[372,8,372,9],[372,12,372,13],[365,4,366,4],[365,5,366,5],[365,8,366,8],[365,9,366,9],[365,12,366,12],[365,13,366,13],[399,4,399,5],[399,8,399,9],[399,12,399,13],[408,4,408,5],[408,8,408,9],[408,12,408,13],[382,4,382,5],[382,8,382,9],[382,12,382,13],[386,4,386,5],[386,8,386,9],[386,12,386,13],[431,4,431,5],[431,8,431,9],[431,12,431,13],[436,4,436,5],[436,8,436,9],[436,12,436,13],[420,4,420,5],[420,8,420,9],[420,12,420,13],[427,4,427,5],[427,8,427,9],[427,12,427,13],[446,4,446,5],[446,8,446,9],[446,12,446,13],[447,4,447,5],[447,8,447,9],[447,12,447,13],[441,4,441,5],[441,8,441,9],[441,12,441,13],[445,4,445,5],[445,8,445,9],[445,12,445,13],[450,4,450,5],[450,8,450,9],[450,12,450,13],[451,4,451,5],[451,8,451,9],[451,12,451,13],[448,4,448,5],[448,8,448,9],[448,12,448,13],[449,4,449,5],[449,8,449,9],[449,12,449,13],[469,4,469,5],[469,8,469,9],[469,12,469,13],[470,4,471,4],[470,5,471,5],[470,8,471,8],[470,9,471,9],[470,12,471,12],[470,13,471,13],[490,8,490,9],[490,12,490,13],[502,8,502,9],[502,12,502,13],[511,8,511,9],[511,12,511,13],[472,4,472,5],[472,8,472,9],[472,12,472,13],[477,8,477,9],[477,12,477,13],[486,8,486,9],[486,12,486,13],[542,8,542,9],[542,12,542,13],[547,8,547,9],[547,12,547,13],[551,8,551,9],[551,12,551,13],[526,8,526,9],[526,12,526,13],[533,8,533,9],[533,12,533,13],[537,8,537,9],[537,12,537,13],[554,4,554,5],[554,8,554,9],[554,12,554,13],[555,4,555,5],[555,8,555,9],[555,12,555,13],[552,4,552,5],[552,8,552,9],[552,12,552,13],[553,4,553,5],[553,8,553,9],[553,12,553,13],[558,4,558,5],[558,8,558,9],[558,12,558,13],[559,4,559,5],[559,8,559,9],[559,12,559,13],[556,4,556,5],[556,8,556,9],[556,12,556,13],[557,4,557,5],[557,8,557,9],[557,12,557,13],[579,4,579,5],[579,8,579,9],[579,12,579,13],[584,4,584,5],[584,8,584,9],[584,12,584,13],[576,4,576,5],[576,8,576,9],[576,12,576,13],[577,4,578,4],[577,5,578,5],[577,8,578,8],[577,9,578,9],[577,12,578,12],[577,13,578,13],[609,4,609,5],[609,8,609,9],[609,12,609,13],[618,4,618,5],[618,8,618,9],[618,12,618,13],[593,4,593,5],[593,8,593,9],[593,12,593,13],[597,4,597,5],[597,8,597,9],[597,12,597,13],[637,4,637,5],[637,8,637,9],[637,12,637,13],[642,4,642,5],[642,8,642,9],[642,12,642,13],[627,4,627,5],[627,8,627,9],[627,12,627,13],[633,4,633,5],[633,8,633,9],[633,12,633,13],[653,4,653,5],[653,8,653,9],[653,12,653,13],[654,4,654,5],[654,8,654,9],[654,12,654,13],[648,4,648,5],[648,8,648,9],[648,12,648,13],[652,4,652,5],[652,8,652,9],[652,12,652,13],[657,4,657,5],[657,8,657,9],[657,12,657,13],[658,4,658,5],[658,8,658,9],[658,12,658,13],[655,4,655,5],[655,8,655,9],[655,12,655,13],[656,4,656,5],[656,8,656,9],[656,12,656,13]]}
[]
[]
[]
[null,null,null,null,"Titel","Maatregelen circulaire nieuwbouw, Versnellingslab"]
[null,null,null,null,"Versie","1.0"]
[null,null,null,null,"Datum ","2023-05-10"]
[]
[]
[]
[null,null,null,null,"Traditioneel",null,null,null,"Het Nieuwe Normaal",null,null,null,"Het Nieuwe Normaal ambitieus"]
[]
[null,null,null,null,"WONEN",null,null,null,"WONEN",null,null,null,"WONEN"]
[]
[]
[]
[]
[]
[]
[null,null,null,null,null,null,null,{"$f":"0.696-I19","v":0.61049999999999993},{"$f":"0.095-0.0095","v":8.5500000000000007E-2}]
[]
[]
[]
[]
[]
[]
[null,null,null,null,"Woning S tussen",null,null,null,"Woning S tussen",null,null,null,"Woning S tussen"]
[null,null,null,null,"Element","Materialisatie",null,null,"Element","Materialisatie",null,null,"Element","Materialisatie"]
[]
[null,null,null,null,"Fundering",null,null,null,"Fundering",null,null,null,"Fundering"]
[null,null,null,"FU03.t",{"$f":"VLOOKUP(D30,'Input Wonen'!$D$13:$H$151,2,FALSE)","v":"Funderingspaal, ⌀ 300mm; l=15,0m"},{"$f":"VLOOKUP(D30,'Input Wonen'!$D$13:$H$151,3,FALSE)","v":"Schroefpaal; beton, in het werk gestort, C20/25,CEMIII; incl.wapening"},null,"FU03.HNN",{"$f":"IFERROR(VLOOKUP(H30,'Input Wonen'!$J$13:$N$151,COLUMNS('Input Wonen'!J:K),FALSE),\"\")","v":"Funderingspaal, ⌀ 300mm; l=15,0m"},{"$f":"IFERROR(VLOOKUP(H30,'Input Wonen'!$J$13:$N$151,COLUMNS('Input Wonen'!J:L),FALSE),\"\")","v":"Beton met 56% aan secundair aandeel (UMC)"},null,"FU03.E",{"$f":"IFERROR(VLOOKUP(L30,'Input Wonen'!$P$13:$T$151,COLUMNS('Input Wonen'!P:Q),FALSE),\"\")","v":"Funderingspaal, ⌀ 300mm; l=15,0m"},{"$f":"IFERROR(VLOOKUP(L30,'Input Wonen'!$P$13:$T$151,COLUMNS('Input Wonen'!P:R),FALSE),\"\")","v":"Beton met 56% aan secundair aandeel (UMC)"}]
{"$rows_left_out":630}
{"sheet":"Input P1","index":2,"n_rows":479,"n_cols":20,"rows_kept":479,"cut":false,"hidden":true,"merged":[[256,12,257,12],[256,15,257,15],[256,16,257,16],[3,5,3,8],[25,4,25,9],[25,11,25,16],[26,4,27,4],[26,5,27,5],[26,6,27,6],[26,7,27,7],[26,8,27,8],[26,9,27,9],[26,11,27,11],[31,4,31,9],[31,11,31,16],[42,4,42,9],[42,11,42,16],[55,4,55,9],[55,11,55,16],[26,12,27,12],[26,13,27,13],[26,14,27,14],[26,15,27,15],[26,16,27,16],[28,4,28,9],[28,11,28,16],[84,4,84,9],[84,11,84,16],[88,4,88,9],[88,11,88,16],[95,4,95,9],[95,11,95,16],[70,4,70,9],[70,11,70,16],[75,4,75,9],[75,11,75,16],[78,4,78,9],[78,11,78,16],[96,11,97,11],[96,12,97,12],[96,13,97,13],[96,14,97,14],[96,15,97,15],[96,16,97,16],[96,4,97,4],[96,5,97,5],[96,6,97,6],[96,7,97,7],[96,8,97,8],[96,9,97,9],[113,4,113,9],[113,11,113,16],[126,4,126,9],[126,11,126,16],[135,4,135,9],[135,11,135,16],[98,4,98,9],[98,11,98,16],[101,4,101,9],[101,11,101,16],[111,4,111,9],[111,11,111,16],[157,4,157,9],[157,11,157,16],[161,4,161,9],[161,11,161,16],[168,4,168,9],[168,11,168,16],[144,4,144,9],[144,11,144,16],[149,4,149,9],[149,11,149,16],[152,4,152,9],[152,11,152,16],[171,4,171,9],[171,11,171,16],[174,4,174,9],[174,11,174,16],[185,4,185,9],[185,11,185,16],[169,11,170,11],[169,12,170,12],[169,13,170,13],[169,14,170,14],[169,15,170,15],[169,16,170,16],[169,4,170,4],[169,5,170,5],[169,6,170,6],[169,7,170,7],[169,8,170,8],[169,9,170,9],[217,4,217,9],[217,11,217,16],[220,4,220,9],[220,11,220,16],[226,4,226,9],[226,11,226,16],[197,4,197,9],[197,11,197,16],[202,4,202,9],[202,11,202,16],[212,4,212,9],[212,11,212,16],[230,4,230,9],[230,11,230,16],[237,4,237,9],[237,11,237,16],[238,4,239,4],[238,5,239,5],[238,6,239,6],[238,7,239,7],[238,8,239,8],[238,9,239,9],[240,4,240,9],[240,11,240,16],[243,4,243,9],[243,11,243,16],[254,4,254,9],[254,11,254,16],[238,11,239,11],[238,12,239,12],[238,13,239,13],[238,14,239,14],[238,15,239,15],[238,16,239,16],[295,4,295,9],[295,11,295,16],[298,4,298,9],[298,11,298,16],[308,4,308,9],[308,11,308,16],[268,4,268,9],[268,11,268,16],[280,4,280,9],[280,11,280,16],[289,4,289,9],[289,11,289,16],[330,4,330,9],[330,11,330,16],[331,4,332,4],[331,5,332,5],[331,6,332,6],[331,7,332,7],[331,8,332,8],[331,9,332,9],[331,11,332,11],[331,12,332,12],[337,4,337,9],[337,11,337,16],[349,4,349,9],[349,11,349,16],[362,4,362,9],[362,11,362,16],[331,13,332,13],[331,14,332,14],[331,15,332,15],[331,16,332,16],[333,4,333,9],[333,11,333,16],[389,4,389,9],[389,11,389,16],[394,4,394,9],[394,11,394,16],[400,4,400,9],[400,11,400,16],[370,4,370,9],[370,11,370,16],[380,4,380,9],[380,11,380,16],[385,4,385,9],[385,11,385,16],[407,4,407,9],[407,11,407,16],[408,4,409,4],[408,5,409,5],[408,6,409,6],[408,7,409,7],[408,8,409,8],[408,9,409,9],[408,11,409,11],[408,12,409,12],[415,4,415,9],[415,11,415,16],[425,4,425,9],[425,11,425,16],[438,4,438,9],[438,11,438,16],[408,13,409,13],[408,14,409,14],[408,15,409,15],[408,16,409,16],[410,4,410,9],[410,11,410,16],[464,4,464,9],[464,11,464,16],[469,4,469,9],[469,11,469,16],[475,4,475,9],[475,11,475,16],[444,4,444,9],[444,11,444,16],[455,4,455,9],[455,11,455,16],[460,4,460,9],[460,11,460,16]]}
[]
[]
[null,null,null,null,"Project",null,null,null,null,null,null,null,null,null,null,null,null,"Projectcode:",null,"0447.005"]
[null,null,null,null,"Onderwerp"]
[null,null,null,null,"Opgesteld",null,null,null,null,null,null,null,null,null,null,null,null,"Versie:",null,"0.1"]
[null,null,null,null,"Gecontroleerd",null,null,null,null,null,null,null,null,null,null,null,null,"Versie datum:",null,"2022-04-25"]
[null,null,null,null,"Bestand:",null,null,null,null,null,null,null,null,null,null,null,null,"Status:",null,"concept"]
[]
[]
[null,null,null,null,"TRADITIONEEL BOUWEN",null,null,null,null,null,null,"CIRCULAIR BOUWEN"]
[]
[null,null,null,null,"GRONDGEBONDEN WONINGBOUW",null,null,null,null,null,null,"GRONDGEBONDEN WONINGBOUW"]
[]
[]
[]
[]
[]
[]
[]
[]
[]
[]
[]
[]
[]
[null,null,null,null,"Woning S tussen",null,null,null,null,null,null,"Woning S tussen"]
[null,null,null,null,"Element","Materialisatie","Hoeveelheid","Ehd","Ehd.prijs \n(directe bouwkosten)","Totale directe \nbouwkosten",null,"Element","Materialisatie","Hoeveelheid","Ehd","Ehd.prijs \n(directe bouwkosten)","Totale directe \nbouwkosten"]
[]
[null,null,null,null,"Fundering",null,null,null,null,null,null,"Fundering"]
[null,null,null,"FU02","Funderingsbalken, 400x500mm","In het werk gestort",19.399999999999999,"m1",{"$f":"VLOOKUP(D30,'Input Wonen'!$D$13:$H$151,4,FALSE)","v":{"$error":"#N/A"}},{"$f":"G30*I30","v":{"$error":"#N/A"}},null,"Funderingsbalken, 400x500mm","Beton met 30% recyclaat",19.399999999999999,"m1","Kosten opvragen",{"$f":"N30*P30","v":{"$error":"#VALUE!"}}]
{"$rows_left_out":449}